BDBM50179587 (+)-N-(2-(2-((3R,3aS,4S,4aR,8aS,9aR)-3-methyl-1-oxo-dodecahydronaphtho[2,3-c]furan-4-yl)vinyl)quinolin-6-yl)butyramide::CHEMBL203992
SMILES: CCCC(=O)Nc1ccc2nc(\C=C\[C@@H]3[C@@H]4[C@@H](C)OC(=O)[C@@H]4C[C@@H]4CCCC[C@@H]34)ccc2c1
InChI Key: InChIKey=LMVCJVAQGNCMEQ-CZCAORCASA-N
Data: 1 IC50
Activity Spreadsheet -- Enzyme Inhibition Constant Data from BindingDB
Found 1 hit for monomerid = 50179587
Trg + Lig
Ki
nM
ΔG°
kcal/mole
IC50
nM
Kd
nM
EC50/IC50
nM
koff
s-1
kon
M-1s-1
pHTemp
°C
Proteinase-activated receptor 1
(Homo sapiens (Human))
BDBM50179587
((+)-N-(2-(2-((3R,3aS,4S,4aR,8aS,9aR)-3-methyl-1-ox...)
Show SMILES CCCC(=O)Nc1ccc2nc(\C=C\[C@@H]3[C@@H]4[C@@H](C)OC(=O)[C@@H]4C[C@@H]4CCCC[C@@H]34)ccc2c1
Show InChI InChI=1S/C28H34N2O3/c1-3-6-26(31)30-21-12-14-25-19(15-21)9-10-20(29-25)11-13-23-22-8-5-4-7-18(22)16-24-27(23)17(2)33-28(24)32/h9-15,17-18,22-24,27H,3-8,16H2,1-2H3,(H,30,31)/b13-11+/t17-,18+,22-,23+,24-,27+/m1/s1
n/an/a 28n/an/an/an/an/an/a
Schering-Plough Research Institute
Curated by ChEMBL
Assay Description
Displacement of [3H]haTRAP from PAR1 in human platelet membrane
Bioorg Med Chem Lett 16: 1544-8 (2006)
Article DOI: 10.1016/j.bmcl.2005.12.042
BindingDB Entry DOI: 10.7270/Q2KH0MXM