BDBM50179725 (S)-2-amino-3-cyclohexylpropanoic acid::2-AMINO-3-CYCLOHEXYL-PROPIONIC ACID::BETA-CYCLOHEXYL-ALANINE::CHEMBL383208
SMILES: N[C@@H](CC1CCCCC1)C(O)=O
InChI Key: InChIKey=ORQXBVXKBGUSBA-QMMMGPOBSA-N
Data: 1 KI  1 IC50
PDB links: 51 PDB IDs match this monomer.
Activity Spreadsheet -- Enzyme Inhibition Constant Data from BindingDB
Found 2 hits for monomerid = 50179725
Trg + Lig
Ki
nM
ΔG°
kcal/mole
IC50
nM
Kd
nM
EC50/IC50
nM
koff
s-1
kon
M-1s-1
pHTemp
°C
Voltage-gated calcium channel alpha2/delta subunit 1
(Mus musculus)
BDBM50179725
((S)-2-amino-3-cyclohexylpropanoic acid | 2-AMINO-3...)
Show SMILES N[C@@H](CC1CCCCC1)C(O)=O
Show InChI InChI=1S/C9H17NO2/c10-8(9(11)12)6-7-4-2-1-3-5-7/h7-8H,1-6,10H2,(H,11,12)/t8-/m0/s1
90n/an/an/an/an/an/an/an/a
Abbott Laboratories
Curated by ChEMBL
Assay Description
Displacement of [3H]L-leucine from alpha2delta containing calcium channel in murine brain
Bioorg Med Chem Lett 16: 1138-41 (2006)
Article DOI: 10.1016/j.bmcl.2005.11.108
BindingDB Entry DOI: 10.7270/Q2XS5TXV
Large neutral amino acids transporter small subunit 1
(Homo sapiens (Human))
BDBM50179725
((S)-2-amino-3-cyclohexylpropanoic acid | 2-AMINO-3...)
Show SMILES N[C@@H](CC1CCCCC1)C(O)=O
Show InChI InChI=1S/C9H17NO2/c10-8(9(11)12)6-7-4-2-1-3-5-7/h7-8H,1-6,10H2,(H,11,12)/t8-/m0/s1
n/an/a 2.00E+5n/an/an/an/an/an/a
University of California
Curated by ChEMBL
Assay Description
Cis-inhibition of human LAT1 expressed in TREx HEK293 cells at 200 uM assessed as inhibition of [3H]-gabapentin uptake preincubated for 3 mins at 37 ...
J Med Chem 61: 7358-7373 (2018)
Article DOI: 10.1021/acs.jmedchem.8b01007
BindingDB Entry DOI: 10.7270/Q2XK8J66