BDBM50179944 1-(8-bromo-11,12-dihydro-6H-dibenzo[b,f]azocin-5-yl)-ethanone::CHEMBL203947
SMILES: CC(=O)N1Cc2cc(Br)ccc2CCc2ccccc12
InChI Key: InChIKey=IWZPMVGKGUWIMO-UHFFFAOYSA-N
Data: 2 IC50
Activity Spreadsheet -- Enzyme Inhibition Constant Data from BindingDB
Found 2 hits for monomerid = 50179944
Trg + Lig
Ki
nM
ΔG°
kcal/mole
IC50
nM
Kd
nM
EC50/IC50
nM
koff
s-1
kon
M-1s-1
pHTemp
°C
17-beta-hydroxysteroid dehydrogenase type 3
(Homo sapiens (Human))
BDBM50179944
(1-(8-bromo-11,12-dihydro-6H-dibenzo[b,f]azocin-5-y...)
Show SMILES CC(=O)N1Cc2cc(Br)ccc2CCc2ccccc12
Show InChI InChI=1S/C17H16BrNO/c1-12(20)19-11-15-10-16(18)9-8-13(15)6-7-14-4-2-3-5-17(14)19/h2-5,8-10H,6-7,11H2,1H3
Reactome pathway
n/an/a 9n/an/an/an/an/an/a
Bristol-Myers Squibb Pharmaceutical Research Institute
Curated by ChEMBL
Assay Description
Inhibition of 17beta-HSD3
Bioorg Med Chem Lett 16: 1532-6 (2006)
Article DOI: 10.1016/j.bmcl.2005.12.039
BindingDB Entry DOI: 10.7270/Q2CV4HBV
17-beta-hydroxysteroid dehydrogenase type 3
(Homo sapiens (Human))
BDBM50179944
(1-(8-bromo-11,12-dihydro-6H-dibenzo[b,f]azocin-5-y...)
Show SMILES CC(=O)N1Cc2cc(Br)ccc2CCc2ccccc12
Show InChI InChI=1S/C17H16BrNO/c1-12(20)19-11-15-10-16(18)9-8-13(15)6-7-14-4-2-3-5-17(14)19/h2-5,8-10H,6-7,11H2,1H3
Reactome pathway
n/an/a 32n/an/an/an/an/an/a
Bristol-Myers Squibb Pharmaceutical Research Institute
Curated by ChEMBL
Assay Description
Inhibition of 17beta-HSD3 by SEAP assay
Bioorg Med Chem Lett 16: 1532-6 (2006)
Article DOI: 10.1016/j.bmcl.2005.12.039
BindingDB Entry DOI: 10.7270/Q2CV4HBV