BDBM50179951 1-(3-fluoro-6,11-dihydro-5-thia-12-aza-dibenzo[a,e]cycloocten-12-yl)-ethanone::CHEMBL203237
SMILES: CC(=O)N1Cc2ccccc2CSc2cc(F)ccc12
InChI Key: InChIKey=FUPGGNAACQZRST-UHFFFAOYSA-N
Data: 2 IC50
Activity Spreadsheet -- Enzyme Inhibition Constant Data from BindingDB
Found 2 hits for monomerid = 50179951
Trg + Lig
Ki
nM
ΔG°
kcal/mole
IC50
nM
Kd
nM
EC50/IC50
nM
koff
s-1
kon
M-1s-1
pHTemp
°C
17-beta-hydroxysteroid dehydrogenase type 3
(Homo sapiens (Human))
BDBM50179951
(1-(3-fluoro-6,11-dihydro-5-thia-12-aza-dibenzo[a,e...)
Show SMILES CC(=O)N1Cc2ccccc2CSc2cc(F)ccc12
Show InChI InChI=1S/C16H14FNOS/c1-11(19)18-9-12-4-2-3-5-13(12)10-20-16-8-14(17)6-7-15(16)18/h2-8H,9-10H2,1H3
Reactome pathway
n/an/a 290n/an/an/an/an/an/a
Bristol-Myers Squibb Pharmaceutical Research Institute
Curated by ChEMBL
Assay Description
Inhibition of 17beta-HSD3 by SEAP assay
Bioorg Med Chem Lett 16: 1532-6 (2006)
Article DOI: 10.1016/j.bmcl.2005.12.039
BindingDB Entry DOI: 10.7270/Q2CV4HBV
17-beta-hydroxysteroid dehydrogenase type 3
(Homo sapiens (Human))
BDBM50179951
(1-(3-fluoro-6,11-dihydro-5-thia-12-aza-dibenzo[a,e...)
Show SMILES CC(=O)N1Cc2ccccc2CSc2cc(F)ccc12
Show InChI InChI=1S/C16H14FNOS/c1-11(19)18-9-12-4-2-3-5-13(12)10-20-16-8-14(17)6-7-15(16)18/h2-8H,9-10H2,1H3
Reactome pathway
n/an/a 90n/an/an/an/an/an/a
Bristol-Myers Squibb Pharmaceutical Research Institute
Curated by ChEMBL
Assay Description
Inhibition of 17beta-HSD3
Bioorg Med Chem Lett 16: 1532-6 (2006)
Article DOI: 10.1016/j.bmcl.2005.12.039
BindingDB Entry DOI: 10.7270/Q2CV4HBV