BDBM50180020 4-oxo-1-pentyl-1,4-dihydro-quinoline-3-carboxylic acid (3,5-dimethyl-adamantan-1-yl)-amide::CHEMBL372544::N3-(1-(3,5-dimethyl)adamantyl)-4-oxo-1-pentyl-1,4-dihydroquinoline-3-carboxamide
SMILES: CCCCCn1cc(C(=O)NC23CC4CC(C)(CC(C)(C4)C2)C3)c(=O)c2ccccc12
InChI Key: InChIKey=GXVOMEXKBUSDHO-UHFFFAOYSA-N
Data: 1 KI  1 EC50
Activity Spreadsheet -- Enzyme Inhibition Constant Data from BindingDB
Found 2 hits for monomerid = 50180020
Trg + Lig
Ki
nM
ΔG°
kcal/mole
IC50
nM
Kd
nM
EC50/IC50
nM
koff
s-1
kon
M-1s-1
pHTemp
°C
Cannabinoid receptor 2
(Homo sapiens (Human))
BDBM50180020
(4-oxo-1-pentyl-1,4-dihydro-quinoline-3-carboxylic ...)
Show SMILES CCCCCn1cc(C(=O)NC23CC4CC(C)(CC(C)(C4)C2)C3)c(=O)c2ccccc12 |TLB:14:15:20.13.12:21,22:11:20:17.14.15,THB:14:13:21:17.15.22,10:11:20:17.14.15,22:15:20:12.11.21,16:15:20:12.11.21,16:15:20.13.12:21|
Show InChI InChI=1S/C27H36N2O2/c1-4-5-8-11-29-15-21(23(30)20-9-6-7-10-22(20)29)24(31)28-27-14-19-12-25(2,17-27)16-26(3,13-19)18-27/h6-7,9-10,15,19H,4-5,8,11-14,16-18H2,1-3H3,(H,28,31)
Reactome pathway
15.8n/an/an/an/an/an/an/an/a
Universit£ de Lille 2
Curated by ChEMBL
Assay Description
Displacement of [3H]CP-55940 from human CB2 receptor
J Med Chem 49: 70-9 (2006)
Article DOI: 10.1021/jm050467q
BindingDB Entry DOI: 10.7270/Q2X067VC
Cannabinoid receptor 2
(Homo sapiens (Human))
BDBM50180020
(4-oxo-1-pentyl-1,4-dihydro-quinoline-3-carboxylic ...)
Show SMILES CCCCCn1cc(C(=O)NC23CC4CC(C)(CC(C)(C4)C2)C3)c(=O)c2ccccc12 |TLB:14:15:20.13.12:21,22:11:20:17.14.15,THB:14:13:21:17.15.22,10:11:20:17.14.15,22:15:20:12.11.21,16:15:20:12.11.21,16:15:20.13.12:21|
Show InChI InChI=1S/C27H36N2O2/c1-4-5-8-11-29-15-21(23(30)20-9-6-7-10-22(20)29)24(31)28-27-14-19-12-25(2,17-27)16-26(3,13-19)18-27/h6-7,9-10,15,19H,4-5,8,11-14,16-18H2,1-3H3,(H,28,31)
Reactome pathway
n/an/an/an/a 14.1n/an/an/an/a
Universit£ de Lille 2
Curated by ChEMBL
Assay Description
Effect on [35S]GTP-gamma-S binding to human CB2 receptor
J Med Chem 49: 70-9 (2006)
Article DOI: 10.1021/jm050467q
BindingDB Entry DOI: 10.7270/Q2X067VC