BDBM50180138 5-(2,4-dichlorobenzyl)-3,5-dimethyl-4-hydroxy-5H-thiophen-2-one::CHEMBL200281
SMILES: CC1C(=O)SC(C)(Cc2ccc(Cl)cc2Cl)C1=O
InChI Key: InChIKey=QEUNSUZABLYMIF-UHFFFAOYSA-N
Data: 1 IC50
Activity Spreadsheet -- Enzyme Inhibition Constant Data from BindingDB
Found 1 hit for monomerid = 50180138
Trg + Lig
Ki
nM
ΔG°
kcal/mole
IC50
nM
Kd
nM
EC50/IC50
nM
koff
s-1
kon
M-1s-1
pHTemp
°C
β-Ketoacyl-acyl carrier protein (ACP) synthase III (FabH)
(Mycobacterium tuberculosis)
BDBM50180138
(5-(2,4-dichlorobenzyl)-3,5-dimethyl-4-hydroxy-5H-t...)
Show SMILES CC1C(=O)SC(C)(Cc2ccc(Cl)cc2Cl)C1=O
Show InChI InChI=1S/C13H12Cl2O2S/c1-7-11(16)13(2,18-12(7)17)6-8-3-4-9(14)5-10(8)15/h3-5,7H,6H2,1-2H3
n/an/a>1.00E+5n/an/an/an/an/an/a
National Institute of Allergy and Infectious Diseases
Curated by ChEMBL
Assay Description
Inhibitory activity against FabH from Mycobacterium tuberculosis H37Rv
J Med Chem 49: 159-71 (2006)
Article DOI: 10.1021/jm050825p
BindingDB Entry DOI: 10.7270/Q2NG4RDB