BDBM50180192 1-((-)-N-cyclobutylmethylmorphinan-3-yl) 10-(3,6-diol-7,8-didehydro-4,5-epoxy-17-methyl-(5alpha,6alpha)morphinan-3-yl) sebacoylate::CHEMBL199931
SMILES: CN1CC[C@@]23[C@H]4Oc5c2c(C[C@@H]1[C@@H]3C=C[C@@H]4O)ccc5OC(=O)CCCCCCCCC(=O)Oc1ccc2C[C@@H]3C4CCCC[C@]4(CCN3CC3CCC3)c2c1
InChI Key: InChIKey=VAFOYDSKVKJZEN-OXGMEHGPSA-N
Data: 3 KI  2 EC50
Activity Spreadsheet -- Enzyme Inhibition Constant Data from BindingDB
Found 5 hits for monomerid = 50180192
Trg + Lig
Ki
nM
ΔG°
kcal/mole
IC50
nM
Kd
nM
EC50/IC50
nM
koff
s-1
kon
M-1s-1
pHTemp
°C
Kappa-type opioid receptor
(Homo sapiens (Human))
BDBM50180192
(1-((-)-N-cyclobutylmethylmorphinan-3-yl) 10-(3,6-d...)
Show SMILES CN1CC[C@@]23[C@H]4Oc5c2c(C[C@@H]1[C@@H]3C=C[C@@H]4O)ccc5OC(=O)CCCCCCCCC(=O)Oc1ccc2C[C@@H]3C4CCCC[C@]4(CCN3CC3CCC3)c2c1 |c:16|
Show InChI InChI=1S/C48H62N2O6/c1-49-25-24-48-36-19-20-40(51)46(48)56-45-41(21-17-33(44(45)48)28-38(36)49)55-43(53)15-7-5-3-2-4-6-14-42(52)54-34-18-16-32-27-39-35-13-8-9-22-47(35,37(32)29-34)23-26-50(39)30-31-11-10-12-31/h16-21,29,31,35-36,38-40,46,51H,2-15,22-28,30H2,1H3/t35?,36-,38+,39+,40-,46-,47+,48-/m0/s1
Reactome pathway
0.110n/an/an/an/an/an/an/an/a
Harvard Medical School
Curated by ChEMBL
Assay Description
Displacement of [3H]U69593 from human kappa opioid receptor expressed in CHO cells
J Med Chem 49: 256-62 (2006)
Article DOI: 10.1021/jm050577x
BindingDB Entry DOI: 10.7270/Q2HQ40QF
Mu-type opioid receptor
(Homo sapiens (Human))
BDBM50180192
(1-((-)-N-cyclobutylmethylmorphinan-3-yl) 10-(3,6-d...)
Show SMILES CN1CC[C@@]23[C@H]4Oc5c2c(C[C@@H]1[C@@H]3C=C[C@@H]4O)ccc5OC(=O)CCCCCCCCC(=O)Oc1ccc2C[C@@H]3C4CCCC[C@]4(CCN3CC3CCC3)c2c1 |c:16|
Show InChI InChI=1S/C48H62N2O6/c1-49-25-24-48-36-19-20-40(51)46(48)56-45-41(21-17-33(44(45)48)28-38(36)49)55-43(53)15-7-5-3-2-4-6-14-42(52)54-34-18-16-32-27-39-35-13-8-9-22-47(35,37(32)29-34)23-26-50(39)30-31-11-10-12-31/h16-21,29,31,35-36,38-40,46,51H,2-15,22-28,30H2,1H3/t35?,36-,38+,39+,40-,46-,47+,48-/m0/s1
NCI pathway
Reactome pathway
0.220n/an/an/an/an/an/an/an/a
Harvard Medical School
Curated by ChEMBL
Assay Description
Displacement of [3H]DAMGO from human mu opioid receptor expressed in CHO cells
J Med Chem 49: 256-62 (2006)
Article DOI: 10.1021/jm050577x
BindingDB Entry DOI: 10.7270/Q2HQ40QF
Delta-type opioid receptor
(Homo sapiens (Human))
BDBM50180192
(1-((-)-N-cyclobutylmethylmorphinan-3-yl) 10-(3,6-d...)
Show SMILES CN1CC[C@@]23[C@H]4Oc5c2c(C[C@@H]1[C@@H]3C=C[C@@H]4O)ccc5OC(=O)CCCCCCCCC(=O)Oc1ccc2C[C@@H]3C4CCCC[C@]4(CCN3CC3CCC3)c2c1 |c:16|
Show InChI InChI=1S/C48H62N2O6/c1-49-25-24-48-36-19-20-40(51)46(48)56-45-41(21-17-33(44(45)48)28-38(36)49)55-43(53)15-7-5-3-2-4-6-14-42(52)54-34-18-16-32-27-39-35-13-8-9-22-47(35,37(32)29-34)23-26-50(39)30-31-11-10-12-31/h16-21,29,31,35-36,38-40,46,51H,2-15,22-28,30H2,1H3/t35?,36-,38+,39+,40-,46-,47+,48-/m0/s1
Reactome pathway
3.90n/an/an/an/an/an/an/an/a
Harvard Medical School
Curated by ChEMBL
Assay Description
Displacement of [3H]naltrindole from human delta opioid receptor expressed in CHO cells
J Med Chem 49: 256-62 (2006)
Article DOI: 10.1021/jm050577x
BindingDB Entry DOI: 10.7270/Q2HQ40QF
Mu-type opioid receptor
(Homo sapiens (Human))
BDBM50180192
(1-((-)-N-cyclobutylmethylmorphinan-3-yl) 10-(3,6-d...)
Show SMILES CN1CC[C@@]23[C@H]4Oc5c2c(C[C@@H]1[C@@H]3C=C[C@@H]4O)ccc5OC(=O)CCCCCCCCC(=O)Oc1ccc2C[C@@H]3C4CCCC[C@]4(CCN3CC3CCC3)c2c1 |c:16|
Show InChI InChI=1S/C48H62N2O6/c1-49-25-24-48-36-19-20-40(51)46(48)56-45-41(21-17-33(44(45)48)28-38(36)49)55-43(53)15-7-5-3-2-4-6-14-42(52)54-34-18-16-32-27-39-35-13-8-9-22-47(35,37(32)29-34)23-26-50(39)30-31-11-10-12-31/h16-21,29,31,35-36,38-40,46,51H,2-15,22-28,30H2,1H3/t35?,36-,38+,39+,40-,46-,47+,48-/m0/s1
NCI pathway
Reactome pathway
n/an/an/an/a 2.5n/an/an/an/a
Harvard Medical School
Curated by ChEMBL
Assay Description
Activity at human mu opioid receptor expressed in CHO cells by [35S]GTP-gamma-S binding assay
J Med Chem 49: 256-62 (2006)
Article DOI: 10.1021/jm050577x
BindingDB Entry DOI: 10.7270/Q2HQ40QF
Kappa-type opioid receptor
(Homo sapiens (Human))
BDBM50180192
(1-((-)-N-cyclobutylmethylmorphinan-3-yl) 10-(3,6-d...)
Show SMILES CN1CC[C@@]23[C@H]4Oc5c2c(C[C@@H]1[C@@H]3C=C[C@@H]4O)ccc5OC(=O)CCCCCCCCC(=O)Oc1ccc2C[C@@H]3C4CCCC[C@]4(CCN3CC3CCC3)c2c1 |c:16|
Show InChI InChI=1S/C48H62N2O6/c1-49-25-24-48-36-19-20-40(51)46(48)56-45-41(21-17-33(44(45)48)28-38(36)49)55-43(53)15-7-5-3-2-4-6-14-42(52)54-34-18-16-32-27-39-35-13-8-9-22-47(35,37(32)29-34)23-26-50(39)30-31-11-10-12-31/h16-21,29,31,35-36,38-40,46,51H,2-15,22-28,30H2,1H3/t35?,36-,38+,39+,40-,46-,47+,48-/m0/s1
Reactome pathway
n/an/an/an/a 2.30n/an/an/an/a
Harvard Medical School
Curated by ChEMBL
Assay Description
Displacement of [3H]U69593 from human kappa opioid receptor expressed in CHO cells
J Med Chem 49: 256-62 (2006)
Article DOI: 10.1021/jm050577x
BindingDB Entry DOI: 10.7270/Q2HQ40QF