BDBM50180660 (3S)-BUTYLPHTHALIDE
SMILES: CCCC[C@@H]1OC(=O)c2ccccc12
InChI Key: InChIKey=HJXMNVQARNZTEE-NSHDSACASA-N
Data: 1 IC50
Activity Spreadsheet -- Enzyme Inhibition Constant Data from BindingDB
Found 1 hit for monomerid = 50180660
Trg + Lig
Ki
nM
ΔG°
kcal/mole
IC50
nM
Kd
nM
EC50/IC50
nM
koff
s-1
kon
M-1s-1
pHTemp
°C
Potassium channel subfamily K member 2
(Rattus norvegicus)
BDBM50180660
((3S)-BUTYLPHTHALIDE)
Show SMILES CCCC[C@@H]1OC(=O)c2ccccc12
Show InChI InChI=1S/C12H14O2/c1-2-3-8-11-9-6-4-5-7-10(9)12(13)14-11/h4-7,11H,2-3,8H2,1H3/t11-/m0/s1
n/an/a 60n/an/an/an/an/an/a
Universit£ Clermont Auvergne
Curated by ChEMBL
Assay Description
Inhibition of of rat TREK1 expressed in CHO cells assessed as reversible current depression
J Med Chem 59: 5149-57 (2016)
BindingDB Entry DOI: 10.7270/Q2319XSS