BDBM50180699 6(4-chloro-3-ethoxy-phenyl)-7-isopropyl-2-methyl-3H-quinazoline-4-one::CHEMBL201247
SMILES: CCOc1cc(ccc1Cl)-c1cc2c(cc1C(C)C)nc(C)[nH]c2=O
InChI Key: InChIKey=YTZUAMKAMKGUOC-UHFFFAOYSA-N
Data: 1 IC50
Activity Spreadsheet -- Enzyme Inhibition Constant Data from BindingDB
Found 1 hit for monomerid = 50180699
Trg + Lig
Ki
nM
ΔG°
kcal/mole
IC50
nM
Kd
nM
EC50/IC50
nM
koff
s-1
kon
M-1s-1
pHTemp
°C
Transient receptor potential cation channel subfamily V member 1
(Homo sapiens (Human))
BDBM50180699
(6(4-chloro-3-ethoxy-phenyl)-7-isopropyl-2-methyl-3...)
Show SMILES CCOc1cc(ccc1Cl)-c1cc2c(cc1C(C)C)nc(C)[nH]c2=O
Show InChI InChI=1S/C20H21ClN2O2/c1-5-25-19-8-13(6-7-17(19)21)15-9-16-18(10-14(15)11(2)3)22-12(4)23-20(16)24/h6-11H,5H2,1-4H3,(H,22,23,24)
Reactome pathway
n/an/a 12n/an/an/an/an/an/a
Novartis Institutes for Biomedical Research
Curated by ChEMBL
Assay Description
Inhibition of calcium influx evoked by capsaicin in human TRPV1 expressing cells by fluorescence assay
J Med Chem 49: 471-4 (2006)
Article DOI: 10.1021/jm051058x
BindingDB Entry DOI: 10.7270/Q2RX9BNT