BDBM50180804 CHEMBL3818549
SMILES: CC(C)CC(O)(c1ccc(C#N)c(Cl)c1Cl)C(F)(F)F
InChI Key: InChIKey=LJVQHXFKJRFYCH-UHFFFAOYSA-N
Data: 1 EC50
Activity Spreadsheet -- Enzyme Inhibition Constant Data from BindingDB
Found 1 hit for monomerid = 50180804
Trg + Lig
Ki
nM
ΔG°
kcal/mole
IC50
nM
Kd
nM
EC50/IC50
nM
koff
s-1
kon
M-1s-1
pHTemp
°C
Androgen Receptor
(Homo sapiens (Human))
BDBM50180804
(CHEMBL3818549)
Show SMILES CC(C)CC(O)(c1ccc(C#N)c(Cl)c1Cl)C(F)(F)F
Show InChI InChI=1S/C13H12Cl2F3NO/c1-7(2)5-12(20,13(16,17)18)9-4-3-8(6-19)10(14)11(9)15/h3-4,7,20H,5H2,1-2H3
NCI pathway
Reactome pathway
n/an/an/an/a 3.20n/an/an/an/a
GlaxoSmithKline
Curated by ChEMBL
Assay Description
Modulation of human androgen receptor expressed in African green monkey CV1 cells after 24 hrs by luciferase reporter gene assay
ACS Med Chem Lett 7: 83-8 (2016)
BindingDB Entry DOI: 10.7270/Q2K35WMN