BDBM50180825 CHEMBL3818826
SMILES: CC(C)C(O)(c1ccc(C#N)c(c1)C(F)(F)F)C(F)(F)F
InChI Key: InChIKey=RKUFRYWOALTUGQ-UHFFFAOYSA-N
Data: 1 EC50
Activity Spreadsheet -- Enzyme Inhibition Constant Data from BindingDB
Found 1 hit for monomerid = 50180825
Trg + Lig
Ki
nM
ΔG°
kcal/mole
IC50
nM
Kd
nM
EC50/IC50
nM
koff
s-1
kon
M-1s-1
pHTemp
°C
Androgen Receptor
(Homo sapiens (Human))
BDBM50180825
(CHEMBL3818826)
Show SMILES CC(C)C(O)(c1ccc(C#N)c(c1)C(F)(F)F)C(F)(F)F
Show InChI InChI=1S/C13H11F6NO/c1-7(2)11(21,13(17,18)19)9-4-3-8(6-20)10(5-9)12(14,15)16/h3-5,7,21H,1-2H3
NCI pathway
Reactome pathway
n/an/an/an/a 7.90n/an/an/an/a
GlaxoSmithKline
Curated by ChEMBL
Assay Description
Modulation of human androgen receptor expressed in African green monkey CV1 cells after 24 hrs by luciferase reporter gene assay
ACS Med Chem Lett 7: 83-8 (2016)
BindingDB Entry DOI: 10.7270/Q2K35WMN