BDBM50180826 CHEMBL3818789
SMILES: CCC(O)(c1ccc(C#N)c(c1)C(F)(F)F)C(F)(F)F
InChI Key: InChIKey=VAVXNTLZPNGTDJ-UHFFFAOYSA-N
Data: 1 EC50
Activity Spreadsheet -- Enzyme Inhibition Constant Data from BindingDB
Found 1 hit for monomerid = 50180826
Trg + Lig
Ki
nM
ΔG°
kcal/mole
IC50
nM
Kd
nM
EC50/IC50
nM
koff
s-1
kon
M-1s-1
pHTemp
°C
Androgen Receptor
(Homo sapiens (Human))
BDBM50180826
(CHEMBL3818789)
Show SMILES CCC(O)(c1ccc(C#N)c(c1)C(F)(F)F)C(F)(F)F
Show InChI InChI=1S/C12H9F6NO/c1-2-10(20,12(16,17)18)8-4-3-7(6-19)9(5-8)11(13,14)15/h3-5,20H,2H2,1H3
NCI pathway
Reactome pathway
n/an/an/an/a 4n/an/an/an/a
GlaxoSmithKline
Curated by ChEMBL
Assay Description
Modulation of human androgen receptor expressed in African green monkey CV1 cells after 24 hrs by luciferase reporter gene assay
ACS Med Chem Lett 7: 83-8 (2016)
BindingDB Entry DOI: 10.7270/Q2K35WMN