BDBM50180992 1,12-Bis(tributyl phosphonium)dodecane dibromide::CHEMBL202870
SMILES: CCCC[P+](CCCC)(CCCC)CCCCCCCCCCCC[P+](CCCC)(CCCC)CCCC
InChI Key: InChIKey=DLZBARBHUSOCRU-UHFFFAOYSA-N
Data: 1 IC50
Activity Spreadsheet -- Enzyme Inhibition Constant Data from BindingDB
Found 1 hit for monomerid = 50180992
Trg + Lig
Ki
nM
ΔG°
kcal/mole
IC50
nM
Kd
nM
EC50/IC50
nM
koff
s-1
kon
M-1s-1
pHTemp
°C
Phospholipase B
(Cryptococcus neoformans)
BDBM50180992
(1,12-Bis(tributyl phosphonium)dodecane dibromide |...)
Show SMILES CCCC[P+](CCCC)(CCCC)CCCCCCCCCCCC[P+](CCCC)(CCCC)CCCC
Show InChI InChI=1S/C36H78P2/c1-7-13-29-37(30-14-8-2,31-15-9-3)35-27-25-23-21-19-20-22-24-26-28-36-38(32-16-10-4,33-17-11-5)34-18-12-6/h7-36H2,1-6H3/q+2
n/an/a>2.50E+4n/an/an/an/an/an/a
The University of Sydney
Curated by ChEMBL
Assay Description
Inhibition of Cryptococccus neoformans H99 PLB1activity
J Med Chem 49: 811-6 (2006)
Article DOI: 10.1021/jm0508843
BindingDB Entry DOI: 10.7270/Q2M61JT1