null
SMILES: CN(Cc1ccccc1)Cc1nc(N)nc(N)c1-c1ccc(NCc2ccc(cc2)S(C)(=O)=O)cc1
InChI Key: InChIKey=WECSIKINZAPKNB-UHFFFAOYSA-N
Activity Spreadsheet -- Enzyme Inhibition Constant Data from BindingDB
Found 2 hits for monomerid = 50181225
Trg + Lig
Ki
nM
ΔG°
kcal/mole
IC50
nM
Kd
nM
EC50/IC50
nM
koff
s-1
kon
M-1s-1
pHTemp
°C
Growth hormone secretagogue receptor type 1
(Homo sapiens (Human))
BDBM50181225
(5-(4-(4-(methylsulfonyl)benzylamino)phenyl)-6-((be...)
Show SMILES CN(Cc1ccccc1)Cc1nc(N)nc(N)c1-c1ccc(NCc2ccc(cc2)S(C)(=O)=O)cc1
Show InChI InChI=1S/C27H30N6O2S/c1-33(17-20-6-4-3-5-7-20)18-24-25(26(28)32-27(29)31-24)21-10-12-22(13-11-21)30-16-19-8-14-23(15-9-19)36(2,34)35/h3-15,30H,16-18H2,1-2H3,(H4,28,29,31,32)
Reactome pathway
n/an/a 4n/an/an/an/an/an/a
Abbott Laboratories
Curated by ChEMBL
Assay Description
Inhibition of human GHS receptor by binding assay
Bioorg Med Chem Lett 16: 1864-8 (2006)
Article DOI: 10.1016/j.bmcl.2006.01.012
BindingDB Entry DOI: 10.7270/Q2610ZW2
Growth hormone secretagogue receptor type 1
(Homo sapiens (Human))
BDBM50181225
(5-(4-(4-(methylsulfonyl)benzylamino)phenyl)-6-((be...)
Show SMILES CN(Cc1ccccc1)Cc1nc(N)nc(N)c1-c1ccc(NCc2ccc(cc2)S(C)(=O)=O)cc1
Show InChI InChI=1S/C27H30N6O2S/c1-33(17-20-6-4-3-5-7-20)18-24-25(26(28)32-27(29)31-24)21-10-12-22(13-11-21)30-16-19-8-14-23(15-9-19)36(2,34)35/h3-15,30H,16-18H2,1-2H3,(H4,28,29,31,32)
Reactome pathway
n/an/a 69n/an/an/an/an/an/a
Abbott Laboratories
Curated by ChEMBL
Assay Description
Inhibition of human GHS receptor by FLIPR
Bioorg Med Chem Lett 16: 1864-8 (2006)
Article DOI: 10.1016/j.bmcl.2006.01.012
BindingDB Entry DOI: 10.7270/Q2610ZW2