BDBM50181322 CHEMBL205184::N-(5-chlorobenzo[d]oxazol-2-yl)-4-(trifluoromethoxy)benzenesulfonamide
SMILES: FC(F)(F)Oc1ccc(cc1)S(=O)(=O)Nc1nc2cc(Cl)ccc2o1
InChI Key: InChIKey=HSCKZUSOGBMLRP-UHFFFAOYSA-N
Data: 1 IC50
Activity Spreadsheet -- Enzyme Inhibition Constant Data from BindingDB
Found 1 hit for monomerid = 50181322
Trg + Lig
Ki
nM
ΔG°
kcal/mole
IC50
nM
Kd
nM
EC50/IC50
nM
koff
s-1
kon
M-1s-1
pHTemp
°C
Fructose-1,6-bisphosphatase 1 (FBPase)
(Homo sapiens (Human))
BDBM50181322
(CHEMBL205184 | N-(5-chlorobenzo[d]oxazol-2-yl)-4-(...)
Show SMILES FC(F)(F)Oc1ccc(cc1)S(=O)(=O)Nc1nc2cc(Cl)ccc2o1
Show InChI InChI=1S/C14H8ClF3N2O4S/c15-8-1-6-12-11(7-8)19-13(23-12)20-25(21,22)10-4-2-9(3-5-10)24-14(16,17)18/h1-7H,(H,19,20)
n/an/a 7.80E+3n/an/an/an/an/an/a
Abbott Laboratories
Curated by ChEMBL
Assay Description
Inhibition of human FBPase1
Bioorg Med Chem Lett 16: 1807-10 (2006)
Article DOI: 10.1016/j.bmcl.2006.01.014
BindingDB Entry DOI: 10.7270/Q2J965ZK