BDBM50181343 CHEMBL207984::N-(5-chlorobenzo[d]oxazol-2-yl)-3-nitrobenzenesulfonamide
SMILES: [O-][N+](=O)c1cccc(c1)S(=O)(=O)Nc1nc2cc(Cl)ccc2o1
InChI Key: InChIKey=FIBATIZLKOYTAW-UHFFFAOYSA-N
Data: 1 IC50
Activity Spreadsheet -- Enzyme Inhibition Constant Data from BindingDB
Found 1 hit for monomerid = 50181343
Trg + Lig
Ki
nM
ΔG°
kcal/mole
IC50
nM
Kd
nM
EC50/IC50
nM
koff
s-1
kon
M-1s-1
pHTemp
°C
Fructose-1,6-bisphosphatase 1 (FBPase)
(Homo sapiens (Human))
BDBM50181343
(CHEMBL207984 | N-(5-chlorobenzo[d]oxazol-2-yl)-3-n...)
Show SMILES [O-][N+](=O)c1cccc(c1)S(=O)(=O)Nc1nc2cc(Cl)ccc2o1
Show InChI InChI=1S/C13H8ClN3O5S/c14-8-4-5-12-11(6-8)15-13(22-12)16-23(20,21)10-3-1-2-9(7-10)17(18)19/h1-7H,(H,15,16)
n/an/a 1.80E+3n/an/an/an/an/an/a
Abbott Laboratories
Curated by ChEMBL
Assay Description
Inhibition of human FBPase1
Bioorg Med Chem Lett 16: 1807-10 (2006)
Article DOI: 10.1016/j.bmcl.2006.01.014
BindingDB Entry DOI: 10.7270/Q2J965ZK