BDBM50181384 CHEMBL370342::N-(3-{2,3-dihydrospiro[indene-1,4'-piperidine]-1'-yl}propyl)-2-methoxy-2-phenylacetamide
SMILES: COC(C(=O)NCCCN1CCC2(CCc3ccccc23)CC1)c1ccccc1
InChI Key: InChIKey=PYWJQTGXTHHDHN-UHFFFAOYSA-N
Data: 1 IC50
Activity Spreadsheet -- Enzyme Inhibition Constant Data from BindingDB
Found 1 hit for monomerid = 50181384
Trg + Lig
Ki
nM
ΔG°
kcal/mole
IC50
nM
Kd
nM
EC50/IC50
nM
koff
s-1
kon
M-1s-1
pHTemp
°C
Nociceptin receptor
(Homo sapiens (Human))
BDBM50181384
(CHEMBL370342 | N-(3-{2,3-dihydrospiro[indene-1,4'-...)
Show SMILES COC(C(=O)NCCCN1CCC2(CCc3ccccc23)CC1)c1ccccc1
Show InChI InChI=1S/C25H32N2O2/c1-29-23(21-9-3-2-4-10-21)24(28)26-16-7-17-27-18-14-25(15-19-27)13-12-20-8-5-6-11-22(20)25/h2-6,8-11,23H,7,12-19H2,1H3,(H,26,28)
Reactome pathway
n/an/a>1.00E+3n/an/an/an/an/an/a
Banyu Tsukuba Research Institute
Curated by ChEMBL
Assay Description
Displacement of [125I]Tyr-nociceptin from cloned human ORL1 expressed in CHO cells
J Med Chem 49: 847-9 (2006)
Article DOI: 10.1021/jm0509851
BindingDB Entry DOI: 10.7270/Q2DJ5F78