BDBM50181422 3-(2H-1,3-benzodioxol-5-yl)-N-(3-{2,3-dihydrospiro[indene-1,4'-piperidine]-1'-yl}propyl)-2-oxopropanamide::CHEMBL202590
SMILES: O=C(Cc1ccc2OCOc2c1)C(=O)NCCCN1CCC2(CCc3ccccc23)CC1
InChI Key: InChIKey=LCJKUGLDKKGUJN-UHFFFAOYSA-N
Data: 1 IC50
Activity Spreadsheet -- Enzyme Inhibition Constant Data from BindingDB
Found 1 hit for monomerid = 50181422
Trg + Lig
Ki
nM
ΔG°
kcal/mole
IC50
nM
Kd
nM
EC50/IC50
nM
koff
s-1
kon
M-1s-1
pHTemp
°C
Nociceptin receptor
(Homo sapiens (Human))
BDBM50181422
(3-(2H-1,3-benzodioxol-5-yl)-N-(3-{2,3-dihydrospiro...)
Show SMILES O=C(Cc1ccc2OCOc2c1)C(=O)NCCCN1CCC2(CCc3ccccc23)CC1
Show InChI InChI=1S/C26H30N2O4/c29-22(16-19-6-7-23-24(17-19)32-18-31-23)25(30)27-12-3-13-28-14-10-26(11-15-28)9-8-20-4-1-2-5-21(20)26/h1-2,4-7,17H,3,8-16,18H2,(H,27,30)
Reactome pathway
n/an/a>1.00E+3n/an/an/an/an/an/a
Banyu Tsukuba Research Institute
Curated by ChEMBL
Assay Description
Displacement of [125I]Tyr-nociceptin from cloned human ORL1 expressed in CHO cells
J Med Chem 49: 847-9 (2006)
Article DOI: 10.1021/jm0509851
BindingDB Entry DOI: 10.7270/Q2DJ5F78