BDBM50181504 CHEMBL3818898
SMILES: CCCCN\C(=N\C#N)N1CC(N(CC)C(=O)CO)C(=N1)c1ccc(Cl)cc1
InChI Key: InChIKey=DRBVFAILYCGTBT-UHFFFAOYSA-N
Data: 2 IC50
Activity Spreadsheet -- Enzyme Inhibition Constant Data from BindingDB
Found 2 hits for monomerid = 50181504
Trg + Lig
Ki
nM
ΔG°
kcal/mole
IC50
nM
Kd
nM
EC50/IC50
nM
koff
s-1
kon
M-1s-1
pHTemp
°C
N-lysine methyltransferase SMYD2
(Homo sapiens (Human))
BDBM50181504
(CHEMBL3818898)
Show SMILES CCCCN\C(=N\C#N)N1CC(N(CC)C(=O)CO)C(=N1)c1ccc(Cl)cc1 |c:19|
Show InChI InChI=1S/C19H25ClN6O2/c1-3-5-10-22-19(23-13-21)26-11-16(25(4-2)17(28)12-27)18(24-26)14-6-8-15(20)9-7-14/h6-9,16,27H,3-5,10-12H2,1-2H3,(H,22,23)
n/an/a>2.00E+4n/an/an/an/an/an/a
BAYER Pharma AG
Curated by ChEMBL
Assay Description
Inhibition of full length 6xHis-tagged SMYD2 (unknown origin) expressed in Escherichia coli using Btn-Ahx GSRAHSSHLKSKKGQSTSRH-amide as substrate aft...
J Med Chem 59: 4578-600 (2016)
BindingDB Entry DOI: 10.7270/Q2RN39S5
Proteinase-activated receptor 1
(Homo sapiens (Human))
BDBM50181504
(CHEMBL3818898)
Show SMILES CCCCN\C(=N\C#N)N1CC(N(CC)C(=O)CO)C(=N1)c1ccc(Cl)cc1 |c:19|
Show InChI InChI=1S/C19H25ClN6O2/c1-3-5-10-22-19(23-13-21)26-11-16(25(4-2)17(28)12-27)18(24-26)14-6-8-15(20)9-7-14/h6-9,16,27H,3-5,10-12H2,1-2H3,(H,22,23)
n/an/a 30n/an/an/an/an/an/a
BAYER Pharma AG
Curated by ChEMBL
Assay Description
Antagonist activity at PAR1 (unknown origin)
J Med Chem 59: 4578-600 (2016)
BindingDB Entry DOI: 10.7270/Q2RN39S5