BDBM50181539 CHEMBL382804::N-(3-fluorophenyl)-2-(2-{[6-methoxy-7-(3-morpholin-4-ylpropoxy)quinazolin-4-yl]amino}-1,3-thiazol-4-yl)acetamide
SMILES: COc1cc2c(Nc3nc(CC(=O)Nc4cccc(F)c4)cs3)ncnc2cc1OCCCN1CCOCC1
InChI Key: InChIKey=NFCAJLCVTMPSFF-UHFFFAOYSA-N
Data: 1 IC50
Activity Spreadsheet -- Enzyme Inhibition Constant Data from BindingDB
Found 1 hit for monomerid = 50181539
Trg + Lig
Ki
nM
ΔG°
kcal/mole
IC50
nM
Kd
nM
EC50/IC50
nM
koff
s-1
kon
M-1s-1
pHTemp
°C
Aurora kinase A
(Homo sapiens (Human))
BDBM50181539
(CHEMBL382804 | N-(3-fluorophenyl)-2-(2-{[6-methoxy...)
Show SMILES COc1cc2c(Nc3nc(CC(=O)Nc4cccc(F)c4)cs3)ncnc2cc1OCCCN1CCOCC1
Show InChI InChI=1S/C27H29FN6O4S/c1-36-23-14-21-22(15-24(23)38-9-3-6-34-7-10-37-11-8-34)29-17-30-26(21)33-27-32-20(16-39-27)13-25(35)31-19-5-2-4-18(28)12-19/h2,4-5,12,14-17H,3,6-11,13H2,1H3,(H,31,35)(H,29,30,32,33)
NCI pathway
Reactome pathway
n/an/a 578n/an/an/an/an/an/a
Centre de Recherches
Curated by ChEMBL
Assay Description
In vitro inhibition constant for Aurora-A
J Med Chem 49: 955-70 (2006)
Article DOI: 10.1021/jm050786h
BindingDB Entry DOI: 10.7270/Q24J0FXV