BDBM50181553 CHEMBL202370::N-(4-fluorophenyl)-2-{[6-methoxy-7-(3-morpholin-4-ylpropoxy)quinazolin-4-yl]amino}-1H-imidazole-5-carboxamide
SMILES: COc1cc2c(Nc3ncc([nH]3)C(=O)Nc3ccc(F)cc3)ncnc2cc1OCCCN1CCOCC1
InChI Key: InChIKey=CZWFMNGZVXFFDM-UHFFFAOYSA-N
Data: 1 IC50
Activity Spreadsheet -- Enzyme Inhibition Constant Data from BindingDB
Found 1 hit for monomerid = 50181553
Trg + Lig
Ki
nM
ΔG°
kcal/mole
IC50
nM
Kd
nM
EC50/IC50
nM
koff
s-1
kon
M-1s-1
pHTemp
°C
Aurora kinase A
(Homo sapiens (Human))
BDBM50181553
(CHEMBL202370 | N-(4-fluorophenyl)-2-{[6-methoxy-7-...)
Show SMILES COc1cc2c(Nc3ncc([nH]3)C(=O)Nc3ccc(F)cc3)ncnc2cc1OCCCN1CCOCC1
Show InChI InChI=1S/C26H28FN7O4/c1-36-22-13-19-20(14-23(22)38-10-2-7-34-8-11-37-12-9-34)29-16-30-24(19)33-26-28-15-21(32-26)25(35)31-18-5-3-17(27)4-6-18/h3-6,13-16H,2,7-12H2,1H3,(H,31,35)(H2,28,29,30,32,33)
NCI pathway
Reactome pathway
n/an/a>1.00E+3n/an/an/an/an/an/a
Centre de Recherches
Curated by ChEMBL
Assay Description
In vitro inhibition constant for Aurora-A
J Med Chem 49: 955-70 (2006)
Article DOI: 10.1021/jm050786h
BindingDB Entry DOI: 10.7270/Q24J0FXV