null
SMILES: CC(C)CCn1c2ccc(F)cc2c(O)c(C2=Nc3ccccc3S(=O)(=O)N2)c1=O
InChI Key: InChIKey=NDGAAHHNCVCWLL-UHFFFAOYSA-N
Activity Spreadsheet -- Enzyme Inhibition Constant Data from BindingDB
Found 2 hits for monomerid = 50181560
Trg + Lig
Ki
nM
ΔG°
kcal/mole
IC50
nM
Kd
nM
EC50/IC50
nM
koff
s-1
kon
M-1s-1
pHTemp
°C
RNA-directed RNA polymerase
(Hepatitis C virus)
BDBM50181560
(3-(1,1-dioxo-1,4-dihydro-1lambda*6*-benzo[1,2,4]th...)
Show SMILES CC(C)CCn1c2ccc(F)cc2c(O)c(C2=Nc3ccccc3S(=O)(=O)N2)c1=O |t:17|
Show InChI InChI=1S/C21H20FN3O4S/c1-12(2)9-10-25-16-8-7-13(22)11-14(16)19(26)18(21(25)27)20-23-15-5-3-4-6-17(15)30(28,29)24-20/h3-8,11-12,26H,9-10H2,1-2H3,(H,23,24)
n/an/an/an/a 261n/an/an/an/a
GlaxoSmithKline
Curated by ChEMBL
Assay Description
Inhibition of HCV RNA replication in Huh7 cells
J Med Chem 49: 971-83 (2006)
Article DOI: 10.1021/jm050855s
BindingDB Entry DOI: 10.7270/Q2N29WJJ
RNA-directed RNA polymerase
(Hepatitis C virus)
BDBM50181560
(3-(1,1-dioxo-1,4-dihydro-1lambda*6*-benzo[1,2,4]th...)
Show SMILES CC(C)CCn1c2ccc(F)cc2c(O)c(C2=Nc3ccccc3S(=O)(=O)N2)c1=O |t:17|
Show InChI InChI=1S/C21H20FN3O4S/c1-12(2)9-10-25-16-8-7-13(22)11-14(16)19(26)18(21(25)27)20-23-15-5-3-4-6-17(15)30(28,29)24-20/h3-8,11-12,26H,9-10H2,1-2H3,(H,23,24)
n/an/a 20n/an/an/an/an/an/a
GlaxoSmithKline
Curated by ChEMBL
Assay Description
Inhibitory activity against HCV delta 21 NS5B RNA polymerase by SPA assay
J Med Chem 49: 971-83 (2006)
Article DOI: 10.1021/jm050855s
BindingDB Entry DOI: 10.7270/Q2N29WJJ