BDBM50181639 1-(4-bromobenzyl)-3-(1,1-dioxo-1,4-dihydrobenzo[1,2,4]thiadiazin-3-yl)-4-hydroxy-1H-quinolin-2-one::CHEMBL201660
SMILES: Oc1c(C2=Nc3ccccc3S(=O)(=O)N2)c(=O)n(Cc2ccc(Br)cc2)c2ccccc12
InChI Key: InChIKey=BOASSNHPGATZRF-UHFFFAOYSA-N
Data: 1 IC50
Activity Spreadsheet -- Enzyme Inhibition Constant Data from BindingDB
Found 1 hit for monomerid = 50181639
Trg + Lig
Ki
nM
ΔG°
kcal/mole
IC50
nM
Kd
nM
EC50/IC50
nM
koff
s-1
kon
M-1s-1
pHTemp
°C
RNA-directed RNA polymerase
(Hepatitis C virus)
BDBM50181639
(1-(4-bromobenzyl)-3-(1,1-dioxo-1,4-dihydrobenzo[1,...)
Show SMILES Oc1c(C2=Nc3ccccc3S(=O)(=O)N2)c(=O)n(Cc2ccc(Br)cc2)c2ccccc12 |t:3|
Show InChI InChI=1S/C23H16BrN3O4S/c24-15-11-9-14(10-12-15)13-27-18-7-3-1-5-16(18)21(28)20(23(27)29)22-25-17-6-2-4-8-19(17)32(30,31)26-22/h1-12,28H,13H2,(H,25,26)
n/an/a 95n/an/an/an/an/an/a
GlaxoSmithKline
Curated by ChEMBL
Assay Description
Inhibitory activity against HCV delta 21 NS5B RNA polymerase by SPA assay
J Med Chem 49: 971-83 (2006)
Article DOI: 10.1021/jm050855s
BindingDB Entry DOI: 10.7270/Q2N29WJJ