BDBM50181837 (1S,7aR)-hexahydro-1H-pyrrolizin-1-ylmethyl 1-methyl-1Hindazole-3-carboxylate::CHEMBL383577
SMILES: Cn1nc(C(=O)OC[C@@H]2CCN3CCC[C@@H]23)c2ccccc12
InChI Key: InChIKey=HSJJCSVABNNXON-JSGCOSHPSA-N
Data: 2 KI  7 IC50
Activity Spreadsheet -- Enzyme Inhibition Constant Data from BindingDB
Found 9 hits for monomerid = 50181837
Trg + Lig
Ki
nM
ΔG°
kcal/mole
IC50
nM
Kd
nM
EC50/IC50
nM
koff
s-1
kon
M-1s-1
pHTemp
°C
HTR4
(GUINEA PIG)
BDBM50181837
((1S,7aR)-hexahydro-1H-pyrrolizin-1-ylmethyl 1-meth...)
Show SMILES Cn1nc(C(=O)OC[C@@H]2CCN3CCC[C@@H]23)c2ccccc12
Show InChI InChI=1S/C17H21N3O2/c1-19-15-6-3-2-5-13(15)16(18-19)17(21)22-11-12-8-10-20-9-4-7-14(12)20/h2-3,5-6,12,14H,4,7-11H2,1H3/t12-,14-/m0/s1
0.400n/an/an/an/an/an/an/an/a
Pfizer Inc.
Curated by ChEMBL
Assay Description
Displacement of [3H]GR-113808 from 5HT4 receptor in guinea pig striatum
J Med Chem 49: 1125-39 (2006)
Article DOI: 10.1021/jm0509501
BindingDB Entry DOI: 10.7270/Q2W096Q0
Serotonin 3a (5-HT3a)/3b (5-HT3b) receptor
(Rattus norvegicus-RAT)
BDBM50181837
((1S,7aR)-hexahydro-1H-pyrrolizin-1-ylmethyl 1-meth...)
Show SMILES Cn1nc(C(=O)OC[C@@H]2CCN3CCC[C@@H]23)c2ccccc12
Show InChI InChI=1S/C17H21N3O2/c1-19-15-6-3-2-5-13(15)16(18-19)17(21)22-11-12-8-10-20-9-4-7-14(12)20/h2-3,5-6,12,14H,4,7-11H2,1H3/t12-,14-/m0/s1
20n/an/an/an/an/an/an/an/a
Pfizer Inc.
Curated by ChEMBL
Assay Description
Displacement of [3H]GR65630 from 5HT3 receptor in brain cortex from Wistar rat
J Med Chem 49: 1125-39 (2006)
Article DOI: 10.1021/jm0509501
BindingDB Entry DOI: 10.7270/Q2W096Q0
Serotonin 2 (5-HT2) receptor
(Homo sapiens (Human))
BDBM50181837
((1S,7aR)-hexahydro-1H-pyrrolizin-1-ylmethyl 1-meth...)
Show SMILES Cn1nc(C(=O)OC[C@@H]2CCN3CCC[C@@H]23)c2ccccc12
Show InChI InChI=1S/C17H21N3O2/c1-19-15-6-3-2-5-13(15)16(18-19)17(21)22-11-12-8-10-20-9-4-7-14(12)20/h2-3,5-6,12,14H,4,7-11H2,1H3/t12-,14-/m0/s1
n/an/a>1.00E+4n/an/an/an/an/an/a
Pfizer Inc.
Curated by ChEMBL
Assay Description
Binding affinity to 5HT2 receptor
J Med Chem 49: 1125-39 (2006)
Article DOI: 10.1021/jm0509501
BindingDB Entry DOI: 10.7270/Q2W096Q0
D(1A) dopamine receptor
(Homo sapiens (Human))
BDBM50181837
((1S,7aR)-hexahydro-1H-pyrrolizin-1-ylmethyl 1-meth...)
Show SMILES Cn1nc(C(=O)OC[C@@H]2CCN3CCC[C@@H]23)c2ccccc12
Show InChI InChI=1S/C17H21N3O2/c1-19-15-6-3-2-5-13(15)16(18-19)17(21)22-11-12-8-10-20-9-4-7-14(12)20/h2-3,5-6,12,14H,4,7-11H2,1H3/t12-,14-/m0/s1
n/an/a>1.00E+4n/an/an/an/an/an/a
Pfizer Inc.
Curated by ChEMBL
Assay Description
Binding affinity to dopamine receptor D1
J Med Chem 49: 1125-39 (2006)
Article DOI: 10.1021/jm0509501
BindingDB Entry DOI: 10.7270/Q2W096Q0
D(2) dopamine receptor
(Homo sapiens (Human))
BDBM50181837
((1S,7aR)-hexahydro-1H-pyrrolizin-1-ylmethyl 1-meth...)
Show SMILES Cn1nc(C(=O)OC[C@@H]2CCN3CCC[C@@H]23)c2ccccc12
Show InChI InChI=1S/C17H21N3O2/c1-19-15-6-3-2-5-13(15)16(18-19)17(21)22-11-12-8-10-20-9-4-7-14(12)20/h2-3,5-6,12,14H,4,7-11H2,1H3/t12-,14-/m0/s1
Reactome pathway
n/an/a>1.00E+4n/an/an/an/an/an/a
Pfizer Inc.
Curated by ChEMBL
Assay Description
Binding affinity to dopamine receptor D2
J Med Chem 49: 1125-39 (2006)
Article DOI: 10.1021/jm0509501
BindingDB Entry DOI: 10.7270/Q2W096Q0
Beta-1 adrenergic receptor
(Homo sapiens (Human))
BDBM50181837
((1S,7aR)-hexahydro-1H-pyrrolizin-1-ylmethyl 1-meth...)
Show SMILES Cn1nc(C(=O)OC[C@@H]2CCN3CCC[C@@H]23)c2ccccc12
Show InChI InChI=1S/C17H21N3O2/c1-19-15-6-3-2-5-13(15)16(18-19)17(21)22-11-12-8-10-20-9-4-7-14(12)20/h2-3,5-6,12,14H,4,7-11H2,1H3/t12-,14-/m0/s1
Reactome pathway
n/an/a>1.00E+4n/an/an/an/an/an/a
Pfizer Inc.
Curated by ChEMBL
Assay Description
Binding affinity to adrenergic beta-1 receptor
J Med Chem 49: 1125-39 (2006)
Article DOI: 10.1021/jm0509501
BindingDB Entry DOI: 10.7270/Q2W096Q0
Adrenergic receptor alpha-2
(Homo sapiens (Human))
BDBM50181837
((1S,7aR)-hexahydro-1H-pyrrolizin-1-ylmethyl 1-meth...)
Show SMILES Cn1nc(C(=O)OC[C@@H]2CCN3CCC[C@@H]23)c2ccccc12
Show InChI InChI=1S/C17H21N3O2/c1-19-15-6-3-2-5-13(15)16(18-19)17(21)22-11-12-8-10-20-9-4-7-14(12)20/h2-3,5-6,12,14H,4,7-11H2,1H3/t12-,14-/m0/s1
n/an/a>1.00E+4n/an/an/an/an/an/a
Pfizer Inc.
Curated by ChEMBL
Assay Description
Binding affinity to adrenergic alpha-2 receptor
J Med Chem 49: 1125-39 (2006)
Article DOI: 10.1021/jm0509501
BindingDB Entry DOI: 10.7270/Q2W096Q0
Beta-2 adrenergic receptor
(Homo sapiens (Human))
BDBM50181837
((1S,7aR)-hexahydro-1H-pyrrolizin-1-ylmethyl 1-meth...)
Show SMILES Cn1nc(C(=O)OC[C@@H]2CCN3CCC[C@@H]23)c2ccccc12
Show InChI InChI=1S/C17H21N3O2/c1-19-15-6-3-2-5-13(15)16(18-19)17(21)22-11-12-8-10-20-9-4-7-14(12)20/h2-3,5-6,12,14H,4,7-11H2,1H3/t12-,14-/m0/s1
Reactome pathway
n/an/a>1.00E+4n/an/an/an/an/an/a
Pfizer Inc.
Curated by ChEMBL
Assay Description
Binding affinity to adrenergic beta-2 receptor
J Med Chem 49: 1125-39 (2006)
Article DOI: 10.1021/jm0509501
BindingDB Entry DOI: 10.7270/Q2W096Q0
Adrenergic receptor alpha-1
(Homo sapiens (Human))
BDBM50181837
((1S,7aR)-hexahydro-1H-pyrrolizin-1-ylmethyl 1-meth...)
Show SMILES Cn1nc(C(=O)OC[C@@H]2CCN3CCC[C@@H]23)c2ccccc12
Show InChI InChI=1S/C17H21N3O2/c1-19-15-6-3-2-5-13(15)16(18-19)17(21)22-11-12-8-10-20-9-4-7-14(12)20/h2-3,5-6,12,14H,4,7-11H2,1H3/t12-,14-/m0/s1
n/an/a>1.00E+4n/an/an/an/an/an/a
Pfizer Inc.
Curated by ChEMBL
Assay Description
Binding affinity to adrenergic alpha-1 receptor
J Med Chem 49: 1125-39 (2006)
Article DOI: 10.1021/jm0509501
BindingDB Entry DOI: 10.7270/Q2W096Q0