BDBM50181876 CHEMBL371861::N-(4'-fluoro-biphenyl-4-carbonyl)-3-nitro-4-(2-phenylsulfanyl-ethylamino)-benzenesulfonamide::N-[(4'-FLUORO-1,1'-BIPHENYL-4-YL)CARBONYL]-3-NITRO-4-{[2-(PHENYLSULFANYL)ETHYL]AMINO}BENZENESULFONAMIDE
SMILES: [O-][N+](=O)c1cc(ccc1NCCSc1ccccc1)S(=O)(=O)NC(=O)c1ccc(cc1)-c1ccc(F)cc1
InChI Key: InChIKey=SWGIDRBGIJDBQO-UHFFFAOYSA-N
Data: 4 KI  8 IC50  2 Kd
PDB links: 1 PDB ID matches this monomer.
Activity Spreadsheet -- Enzyme Inhibition Constant Data from BindingDB
Found 14 hits for monomerid = 50181876
Trg + Lig
Ki
nM
ΔG°
kcal/mole
IC50
nM
Kd
nM
EC50/IC50
nM
koff
s-1
kon
M-1s-1
pHTemp
°C
Bcl-2-like protein 1
(Homo sapiens (Human))
BDBM50181876
(CHEMBL371861 | N-(4'-fluoro-biphenyl-4-carbonyl)-3...)
Show SMILES [O-][N+](=O)c1cc(ccc1NCCSc1ccccc1)S(=O)(=O)NC(=O)c1ccc(cc1)-c1ccc(F)cc1
Show InChI InChI=1S/C27H22FN3O5S2/c28-22-12-10-20(11-13-22)19-6-8-21(9-7-19)27(32)30-38(35,36)24-14-15-25(26(18-24)31(33)34)29-16-17-37-23-4-2-1-3-5-23/h1-15,18,29H,16-17H2,(H,30,32)
NCI pathway
Reactome pathway
36n/an/an/an/an/an/an/an/a
Abbott Laboratories
Curated by ChEMBL
Assay Description
Binding affinity to Bcl-XL by fluorescence polarization assay
J Med Chem 49: 1165-81 (2006)
Article DOI: 10.1021/jm050754u
BindingDB Entry DOI: 10.7270/Q2VM4BT0
Bcl-2-like protein 1
(Homo sapiens (Human))
BDBM50181876
(CHEMBL371861 | N-(4'-fluoro-biphenyl-4-carbonyl)-3...)
Show SMILES [O-][N+](=O)c1cc(ccc1NCCSc1ccccc1)S(=O)(=O)NC(=O)c1ccc(cc1)-c1ccc(F)cc1
Show InChI InChI=1S/C27H22FN3O5S2/c28-22-12-10-20(11-13-22)19-6-8-21(9-7-19)27(32)30-38(35,36)24-14-15-25(26(18-24)31(33)34)29-16-17-37-23-4-2-1-3-5-23/h1-15,18,29H,16-17H2,(H,30,32)
NCI pathway
Reactome pathway
36n/an/an/an/an/an/an/an/a
Bioprojet-Biotech
Curated by ChEMBL
Assay Description
Inhibition of GST-tagged Bcl-xL (unknown origin) measured after 1 hr incubation by fluorescence polarization assay
Bioorg Med Chem 23: 1747-57 (2015)
Article DOI: 10.1016/j.bmc.2015.02.060
BindingDB Entry DOI: 10.7270/Q2F191D6
Apoptosis regulator Bcl-2
(Homo sapiens (Human))
BDBM50181876
(CHEMBL371861 | N-(4'-fluoro-biphenyl-4-carbonyl)-3...)
Show SMILES [O-][N+](=O)c1cc(ccc1NCCSc1ccccc1)S(=O)(=O)NC(=O)c1ccc(cc1)-c1ccc(F)cc1
Show InChI InChI=1S/C27H22FN3O5S2/c28-22-12-10-20(11-13-22)19-6-8-21(9-7-19)27(32)30-38(35,36)24-14-15-25(26(18-24)31(33)34)29-16-17-37-23-4-2-1-3-5-23/h1-15,18,29H,16-17H2,(H,30,32)
433n/an/an/an/an/an/an/an/a
Abbott Laboratories
Curated by ChEMBL
Assay Description
Binding affinity to Bcl2 by fluorescence polarization assay
J Med Chem 49: 1165-81 (2006)
Article DOI: 10.1021/jm050754u
BindingDB Entry DOI: 10.7270/Q2VM4BT0
Bcl-2-like protein 1
(Homo sapiens (Human))
BDBM50181876
(CHEMBL371861 | N-(4'-fluoro-biphenyl-4-carbonyl)-3...)
Show SMILES [O-][N+](=O)c1cc(ccc1NCCSc1ccccc1)S(=O)(=O)NC(=O)c1ccc(cc1)-c1ccc(F)cc1
Show InChI InChI=1S/C27H22FN3O5S2/c28-22-12-10-20(11-13-22)19-6-8-21(9-7-19)27(32)30-38(35,36)24-14-15-25(26(18-24)31(33)34)29-16-17-37-23-4-2-1-3-5-23/h1-15,18,29H,16-17H2,(H,30,32)
NCI pathway
Reactome pathway
2.50E+3n/an/an/an/an/an/an/an/a
Abbott Laboratories
Curated by ChEMBL
Assay Description
Binding affinity to Bcl-XL in 1% human serum by fluorescence polarization assay
J Med Chem 49: 1165-81 (2006)
Article DOI: 10.1021/jm050754u
BindingDB Entry DOI: 10.7270/Q2VM4BT0
Bcl-2-like protein 1
(Homo sapiens (Human))
BDBM50181876
(CHEMBL371861 | N-(4'-fluoro-biphenyl-4-carbonyl)-3...)
Show SMILES [O-][N+](=O)c1cc(ccc1NCCSc1ccccc1)S(=O)(=O)NC(=O)c1ccc(cc1)-c1ccc(F)cc1
Show InChI InChI=1S/C27H22FN3O5S2/c28-22-12-10-20(11-13-22)19-6-8-21(9-7-19)27(32)30-38(35,36)24-14-15-25(26(18-24)31(33)34)29-16-17-37-23-4-2-1-3-5-23/h1-15,18,29H,16-17H2,(H,30,32)
NCI pathway
Reactome pathway
n/an/a 1.50E+3n/an/an/an/an/an/a
The Walter and Eliza Hall Institute of Medical Research
Curated by ChEMBL
Assay Description
Displacement of biotinylated Bim-BH3 from GST-tagged Bcl-Xl by AlphaSCREEN competitive assay
J Med Chem 54: 1914-26 (2011)
Article DOI: 10.1021/jm101596e
BindingDB Entry DOI: 10.7270/Q27P8ZP8
Adenosine A1 receptor
(Mus musculus)
BDBM50181876
(CHEMBL371861 | N-(4'-fluoro-biphenyl-4-carbonyl)-3...)
Show SMILES [O-][N+](=O)c1cc(ccc1NCCSc1ccccc1)S(=O)(=O)NC(=O)c1ccc(cc1)-c1ccc(F)cc1
Show InChI InChI=1S/C27H22FN3O5S2/c28-22-12-10-20(11-13-22)19-6-8-21(9-7-19)27(32)30-38(35,36)24-14-15-25(26(18-24)31(33)34)29-16-17-37-23-4-2-1-3-5-23/h1-15,18,29H,16-17H2,(H,30,32)
n/an/a 1.42E+4n/an/an/an/an/an/a
The Walter and Eliza Hall Institute of Medical Research
Curated by ChEMBL
Assay Description
Inhibition of binding of wild type mBIMBH3 peptide to mouse adenosine A1 receptor by surface plasmon resonance competition experiment
J Med Chem 57: 1323-43 (2014)
Article DOI: 10.1021/jm401948b
BindingDB Entry DOI: 10.7270/Q28C9XQW
Bcl-2-like protein 1
(Homo sapiens (Human))
BDBM50181876
(CHEMBL371861 | N-(4'-fluoro-biphenyl-4-carbonyl)-3...)
Show SMILES [O-][N+](=O)c1cc(ccc1NCCSc1ccccc1)S(=O)(=O)NC(=O)c1ccc(cc1)-c1ccc(F)cc1
Show InChI InChI=1S/C27H22FN3O5S2/c28-22-12-10-20(11-13-22)19-6-8-21(9-7-19)27(32)30-38(35,36)24-14-15-25(26(18-24)31(33)34)29-16-17-37-23-4-2-1-3-5-23/h1-15,18,29H,16-17H2,(H,30,32)
NCI pathway
Reactome pathway
n/an/a 2.20E+3n/an/an/an/an/an/a
The Walter and Eliza Hall Institute of Medical Research
Curated by ChEMBL
Assay Description
Binding affinity to human GST-tagged Bcl-Xl by luminescence proximity assay
J Med Chem 56: 5514-40 (2014)
Article DOI: 10.1021/jm400556w
BindingDB Entry DOI: 10.7270/Q2X92CQT
Bcl-2-like protein 1
(Homo sapiens (Human))
BDBM50181876
(CHEMBL371861 | N-(4'-fluoro-biphenyl-4-carbonyl)-3...)
Show SMILES [O-][N+](=O)c1cc(ccc1NCCSc1ccccc1)S(=O)(=O)NC(=O)c1ccc(cc1)-c1ccc(F)cc1
Show InChI InChI=1S/C27H22FN3O5S2/c28-22-12-10-20(11-13-22)19-6-8-21(9-7-19)27(32)30-38(35,36)24-14-15-25(26(18-24)31(33)34)29-16-17-37-23-4-2-1-3-5-23/h1-15,18,29H,16-17H2,(H,30,32)
NCI pathway
Reactome pathway
n/an/an/a 1.90E+3n/an/an/an/an/a
The Walter and Eliza Hall Institute of Medical Research
Curated by ChEMBL
Assay Description
Binding affinity to human GST-tagged Bcl-Xl assessed as dissociation rate by surface plasmon resonance assay
J Med Chem 56: 5514-40 (2014)
Article DOI: 10.1021/jm400556w
BindingDB Entry DOI: 10.7270/Q2X92CQT
Bcl-2-like protein 1
(Homo sapiens (Human))
BDBM50181876
(CHEMBL371861 | N-(4'-fluoro-biphenyl-4-carbonyl)-3...)
Show SMILES [O-][N+](=O)c1cc(ccc1NCCSc1ccccc1)S(=O)(=O)NC(=O)c1ccc(cc1)-c1ccc(F)cc1
Show InChI InChI=1S/C27H22FN3O5S2/c28-22-12-10-20(11-13-22)19-6-8-21(9-7-19)27(32)30-38(35,36)24-14-15-25(26(18-24)31(33)34)29-16-17-37-23-4-2-1-3-5-23/h1-15,18,29H,16-17H2,(H,30,32)
NCI pathway
Reactome pathway
n/an/an/a 900n/an/an/an/an/a
The Walter and Eliza Hall Institute of Medical Research
Curated by ChEMBL
Assay Description
Binding affinity to human GST-tagged Bcl-Xl assessed as direct binding constant at steady state by surface plasmon resonance assay
J Med Chem 56: 5514-40 (2014)
Article DOI: 10.1021/jm400556w
BindingDB Entry DOI: 10.7270/Q2X92CQT
Bcl-2-like protein 1
(Homo sapiens (Human))
BDBM50181876
(CHEMBL371861 | N-(4'-fluoro-biphenyl-4-carbonyl)-3...)
Show SMILES [O-][N+](=O)c1cc(ccc1NCCSc1ccccc1)S(=O)(=O)NC(=O)c1ccc(cc1)-c1ccc(F)cc1
Show InChI InChI=1S/C27H22FN3O5S2/c28-22-12-10-20(11-13-22)19-6-8-21(9-7-19)27(32)30-38(35,36)24-14-15-25(26(18-24)31(33)34)29-16-17-37-23-4-2-1-3-5-23/h1-15,18,29H,16-17H2,(H,30,32)
NCI pathway
Reactome pathway
n/an/a>1.00E+4n/an/an/an/an/an/a
Abbott Laboratories
Curated by ChEMBL
Assay Description
Inhibitory activity against Bcl-XL in presence of 1% human serum
J Med Chem 49: 1165-81 (2006)
Article DOI: 10.1021/jm050754u
BindingDB Entry DOI: 10.7270/Q2VM4BT0
Apoptosis regulator Bcl-2
(Homo sapiens (Human))
BDBM50181876
(CHEMBL371861 | N-(4'-fluoro-biphenyl-4-carbonyl)-3...)
Show SMILES [O-][N+](=O)c1cc(ccc1NCCSc1ccccc1)S(=O)(=O)NC(=O)c1ccc(cc1)-c1ccc(F)cc1
Show InChI InChI=1S/C27H22FN3O5S2/c28-22-12-10-20(11-13-22)19-6-8-21(9-7-19)27(32)30-38(35,36)24-14-15-25(26(18-24)31(33)34)29-16-17-37-23-4-2-1-3-5-23/h1-15,18,29H,16-17H2,(H,30,32)
n/an/a 93n/an/an/an/an/an/a
Bristol-Myers Squibb Pharmaceutical Research and Development
Curated by ChEMBL
Assay Description
Binding affinity to Bcl2 by fluorescent polarization assay
J Med Chem 54: 2529-91 (2011)
Article DOI: 10.1021/jm1013693
BindingDB Entry DOI: 10.7270/Q24M95PH
Bcl-2-like protein 1
(Homo sapiens (Human))
BDBM50181876
(CHEMBL371861 | N-(4'-fluoro-biphenyl-4-carbonyl)-3...)
Show SMILES [O-][N+](=O)c1cc(ccc1NCCSc1ccccc1)S(=O)(=O)NC(=O)c1ccc(cc1)-c1ccc(F)cc1
Show InChI InChI=1S/C27H22FN3O5S2/c28-22-12-10-20(11-13-22)19-6-8-21(9-7-19)27(32)30-38(35,36)24-14-15-25(26(18-24)31(33)34)29-16-17-37-23-4-2-1-3-5-23/h1-15,18,29H,16-17H2,(H,30,32)
NCI pathway
Reactome pathway
n/an/a 122n/an/an/an/an/an/a
Abbott Laboratories
Curated by ChEMBL
Assay Description
Inhibitory activity against Bcl-XL in presence of alpha1 acid glycoprotein from 1% human serum
J Med Chem 49: 1165-81 (2006)
Article DOI: 10.1021/jm050754u
BindingDB Entry DOI: 10.7270/Q2VM4BT0
Bcl-2-like protein 1
(Homo sapiens (Human))
BDBM50181876
(CHEMBL371861 | N-(4'-fluoro-biphenyl-4-carbonyl)-3...)
Show SMILES [O-][N+](=O)c1cc(ccc1NCCSc1ccccc1)S(=O)(=O)NC(=O)c1ccc(cc1)-c1ccc(F)cc1
Show InChI InChI=1S/C27H22FN3O5S2/c28-22-12-10-20(11-13-22)19-6-8-21(9-7-19)27(32)30-38(35,36)24-14-15-25(26(18-24)31(33)34)29-16-17-37-23-4-2-1-3-5-23/h1-15,18,29H,16-17H2,(H,30,32)
NCI pathway
Reactome pathway
n/an/a>1.00E+4n/an/an/an/an/an/a
Abbott Laboratories
Curated by ChEMBL
Assay Description
Inhibitory activity against Bcl-XL in presence of HSA from 1% human serum
J Med Chem 49: 1165-81 (2006)
Article DOI: 10.1021/jm050754u
BindingDB Entry DOI: 10.7270/Q2VM4BT0
Apoptosis regulator Bcl-2
(Homo sapiens (Human))
BDBM50181876
(CHEMBL371861 | N-(4'-fluoro-biphenyl-4-carbonyl)-3...)
Show SMILES [O-][N+](=O)c1cc(ccc1NCCSc1ccccc1)S(=O)(=O)NC(=O)c1ccc(cc1)-c1ccc(F)cc1
Show InChI InChI=1S/C27H22FN3O5S2/c28-22-12-10-20(11-13-22)19-6-8-21(9-7-19)27(32)30-38(35,36)24-14-15-25(26(18-24)31(33)34)29-16-17-37-23-4-2-1-3-5-23/h1-15,18,29H,16-17H2,(H,30,32)
n/an/a 6.30E+3n/an/an/an/an/an/a
Abbott Laboratories
Curated by ChEMBL
Assay Description
Inhibitory activity against Bcl-XL in presence of HSA3 from 1% human serum
J Med Chem 49: 1165-81 (2006)
Article DOI: 10.1021/jm050754u
BindingDB Entry DOI: 10.7270/Q2VM4BT0