null
SMILES: CC(C)(C)[C@@H]1N(Cc2ccccc2)C(=O)C(C1=O)C1=Nc2ccccc2S(=O)(=O)N1
InChI Key: InChIKey=WVNTUJDNPOATJS-WHCXFUJUSA-N
Activity Spreadsheet -- Enzyme Inhibition Constant Data from BindingDB
Found 1 hit for monomerid = 50181956
Trg + Lig
Ki
nM
ΔG°
kcal/mole
IC50
nM
Kd
nM
EC50/IC50
nM
koff
s-1
kon
M-1s-1
pHTemp
°C
RNA-directed RNA polymerase
(Hepatitis C virus)
BDBM50181956
((S)-1-benzyl-5-tert-butyl-3-(1,1-dioxo-1,4-dihydro...)
Show SMILES CC(C)(C)[C@@H]1N(Cc2ccccc2)C(=O)C(C1=O)C1=Nc2ccccc2S(=O)(=O)N1 |t:20|
Show InChI InChI=1S/C22H23N3O4S/c1-22(2,3)19-18(26)17(21(27)25(19)13-14-9-5-4-6-10-14)20-23-15-11-7-8-12-16(15)30(28,29)24-20/h4-12,17,19H,13H2,1-3H3,(H,23,24)/t17?,19-/m1/s1
n/an/a 22n/an/an/an/an/an/a
GlaxoSmithKline Pharmaceuticals
Curated by ChEMBL
Assay Description
Inhibition of HCV NS5B RNA dependent RNA polymerase
Bioorg Med Chem Lett 16: 2205-8 (2006)
Article DOI: 10.1016/j.bmcl.2006.01.034
BindingDB Entry DOI: 10.7270/Q26T0M6W