null
SMILES: Cc1ccc(I)cc1Nc1ncc2ccn(-c3ccccn3)c2n1
InChI Key: InChIKey=GCGNWFDGTUKVBI-UHFFFAOYSA-N
Activity Spreadsheet -- Enzyme Inhibition Constant Data from BindingDB
Found 1 hit for monomerid = 50181976
Trg + Lig
Ki
nM
ΔG°
kcal/mole
IC50
nM
Kd
nM
EC50/IC50
nM
koff
s-1
kon
M-1s-1
pHTemp
°C
Focal adhesion kinase 1
(Homo sapiens (Human))
BDBM50181976
(CHEMBL383834 | N-(5-iodo-2-methylphenyl)-7-(pyridi...)
Show SMILES Cc1ccc(I)cc1Nc1ncc2ccn(-c3ccccn3)c2n1
Show InChI InChI=1S/C18H14IN5/c1-12-5-6-14(19)10-15(12)22-18-21-11-13-7-9-24(17(13)23-18)16-4-2-3-8-20-16/h2-11H,1H3,(H,21,22,23)
NCI pathway
Reactome pathway
n/an/a 3.00E+3n/an/an/an/an/an/a
Genomics Institute of the Novartis Research Foundation (GNF)
Curated by ChEMBL
Assay Description
Inhibitory activity against FAK
Bioorg Med Chem Lett 16: 2173-6 (2006)
Article DOI: 10.1016/j.bmcl.2006.01.053
BindingDB Entry DOI: 10.7270/Q2319VGX