null
SMILES: COc1ccc(C)c(Nc2ncc3ccn(-c4ccccn4)c3n2)c1
InChI Key: InChIKey=GFYSMCVIJGKQFK-UHFFFAOYSA-N
Activity Spreadsheet -- Enzyme Inhibition Constant Data from BindingDB
Found 1 hit for monomerid = 50181983
Trg + Lig
Ki
nM
ΔG°
kcal/mole
IC50
nM
Kd
nM
EC50/IC50
nM
koff
s-1
kon
M-1s-1
pHTemp
°C
Focal adhesion kinase 1
(Homo sapiens (Human))
BDBM50181983
(CHEMBL377957 | N-(5-methoxy-2-methylphenyl)-7-(pyr...)
Show SMILES COc1ccc(C)c(Nc2ncc3ccn(-c4ccccn4)c3n2)c1
Show InChI InChI=1S/C19H17N5O/c1-13-6-7-15(25-2)11-16(13)22-19-21-12-14-8-10-24(18(14)23-19)17-5-3-4-9-20-17/h3-12H,1-2H3,(H,21,22,23)
NCI pathway
Reactome pathway
n/an/a 200n/an/an/an/an/an/a
Genomics Institute of the Novartis Research Foundation (GNF)
Curated by ChEMBL
Assay Description
Inhibitory activity against FAK
Bioorg Med Chem Lett 16: 2173-6 (2006)
Article DOI: 10.1016/j.bmcl.2006.01.053
BindingDB Entry DOI: 10.7270/Q2319VGX
3D
3D Structure (docked)