null
SMILES: COc1cc(Nc2ncc3ccn(-c4ccncc4)c3n2)cc(OC)c1OC
InChI Key: InChIKey=UNRMNJMAXXXCPZ-UHFFFAOYSA-N
Activity Spreadsheet -- Enzyme Inhibition Constant Data from BindingDB
Found 1 hit for monomerid = 50181990
Trg + Lig
Ki
nM
ΔG°
kcal/mole
IC50
nM
Kd
nM
EC50/IC50
nM
koff
s-1
kon
M-1s-1
pHTemp
°C
Focal adhesion kinase 1
(Homo sapiens (Human))
BDBM50181990
(7-(pyridin-4-yl)-N-(3,4,5-trimethoxyphenyl)-7H-pyr...)
Show SMILES COc1cc(Nc2ncc3ccn(-c4ccncc4)c3n2)cc(OC)c1OC
Show InChI InChI=1S/C20H19N5O3/c1-26-16-10-14(11-17(27-2)18(16)28-3)23-20-22-12-13-6-9-25(19(13)24-20)15-4-7-21-8-5-15/h4-12H,1-3H3,(H,22,23,24)
NCI pathway
Reactome pathway
n/an/a 9.00E+3n/an/an/an/an/an/a
Genomics Institute of the Novartis Research Foundation (GNF)
Curated by ChEMBL
Assay Description
Inhibitory activity against FAK
Bioorg Med Chem Lett 16: 2173-6 (2006)
Article DOI: 10.1016/j.bmcl.2006.01.053
BindingDB Entry DOI: 10.7270/Q2319VGX
3D
3D Structure (docked)