null
SMILES: CCc1ccccc1Nc1ncc2ccn(-c3ccccn3)c2n1
InChI Key: InChIKey=PIXPYTQYQZVSMH-UHFFFAOYSA-N
Activity Spreadsheet -- Enzyme Inhibition Constant Data from BindingDB
Found 1 hit for monomerid = 50181994
Trg + Lig
Ki
nM
ΔG°
kcal/mole
IC50
nM
Kd
nM
EC50/IC50
nM
koff
s-1
kon
M-1s-1
pHTemp
°C
Focal adhesion kinase 1
(Homo sapiens (Human))
BDBM50181994
(CHEMBL382637 | N-(2-ethylphenyl)-7-(pyridin-2-yl)-...)
Show SMILES CCc1ccccc1Nc1ncc2ccn(-c3ccccn3)c2n1
Show InChI InChI=1S/C19H17N5/c1-2-14-7-3-4-8-16(14)22-19-21-13-15-10-12-24(18(15)23-19)17-9-5-6-11-20-17/h3-13H,2H2,1H3,(H,21,22,23)
NCI pathway
Reactome pathway
n/an/a 900n/an/an/an/an/an/a
Genomics Institute of the Novartis Research Foundation (GNF)
Curated by ChEMBL
Assay Description
Inhibitory activity against FAK
Bioorg Med Chem Lett 16: 2173-6 (2006)
Article DOI: 10.1016/j.bmcl.2006.01.053
BindingDB Entry DOI: 10.7270/Q2319VGX