null
SMILES: COc1cc(Nc2ncc3ccn(-c4nccs4)c3n2)cc(OC)c1OC
InChI Key: InChIKey=RVVJFIMJUNHUTB-UHFFFAOYSA-N
Activity Spreadsheet -- Enzyme Inhibition Constant Data from BindingDB
Found 1 hit for monomerid = 50181999
Trg + Lig
Ki
nM
ΔG°
kcal/mole
IC50
nM
Kd
nM
EC50/IC50
nM
koff
s-1
kon
M-1s-1
pHTemp
°C
Focal adhesion kinase 1
(Homo sapiens (Human))
BDBM50181999
(7-(thiazol-2-yl)-N-(3,4,5-trimethoxyphenyl)-7H-pyr...)
Show SMILES COc1cc(Nc2ncc3ccn(-c4nccs4)c3n2)cc(OC)c1OC
Show InChI InChI=1S/C18H17N5O3S/c1-24-13-8-12(9-14(25-2)15(13)26-3)21-17-20-10-11-4-6-23(16(11)22-17)18-19-5-7-27-18/h4-10H,1-3H3,(H,20,21,22)
NCI pathway
Reactome pathway
n/an/a 500n/an/an/an/an/an/a
Genomics Institute of the Novartis Research Foundation (GNF)
Curated by ChEMBL
Assay Description
Inhibitory activity against FAK
Bioorg Med Chem Lett 16: 2173-6 (2006)
Article DOI: 10.1016/j.bmcl.2006.01.053
BindingDB Entry DOI: 10.7270/Q2319VGX