null
SMILES: COc1cc(Nc2ncc3ccn(CCc4cccnc4)c3n2)cc(OC)c1OC
InChI Key: InChIKey=CDEPJOZGPLXGCF-UHFFFAOYSA-N
Activity Spreadsheet -- Enzyme Inhibition Constant Data from BindingDB
Found 1 hit for monomerid = 50182003
Trg + Lig
Ki
nM
ΔG°
kcal/mole
IC50
nM
Kd
nM
EC50/IC50
nM
koff
s-1
kon
M-1s-1
pHTemp
°C
Focal adhesion kinase 1
(Homo sapiens (Human))
BDBM50182003
(7-(2-(pyridin-3-yl)ethyl)-N-(3,4,5-trimethoxypheny...)
Show SMILES COc1cc(Nc2ncc3ccn(CCc4cccnc4)c3n2)cc(OC)c1OC
Show InChI InChI=1S/C22H23N5O3/c1-28-18-11-17(12-19(29-2)20(18)30-3)25-22-24-14-16-7-10-27(21(16)26-22)9-6-15-5-4-8-23-13-15/h4-5,7-8,10-14H,6,9H2,1-3H3,(H,24,25,26)
NCI pathway
Reactome pathway
n/an/a>1.00E+4n/an/an/an/an/an/a
Genomics Institute of the Novartis Research Foundation (GNF)
Curated by ChEMBL
Assay Description
Inhibitory activity against FAK
Bioorg Med Chem Lett 16: 2173-6 (2006)
Article DOI: 10.1016/j.bmcl.2006.01.053
BindingDB Entry DOI: 10.7270/Q2319VGX