null
SMILES: Clc1ccccc1Nc1ncc2ccn(-c3ccccn3)c2n1
InChI Key: InChIKey=SUVZWWYGVDZFFR-UHFFFAOYSA-N
Activity Spreadsheet -- Enzyme Inhibition Constant Data from BindingDB
Found 1 hit for monomerid = 50182005
Trg + Lig
Ki
nM
ΔG°
kcal/mole
IC50
nM
Kd
nM
EC50/IC50
nM
koff
s-1
kon
M-1s-1
pHTemp
°C
Focal adhesion kinase 1
(Homo sapiens (Human))
BDBM50182005
(CHEMBL207935 | N-(2-chlorophenyl)-7-(pyridin-2-yl)...)
Show SMILES Clc1ccccc1Nc1ncc2ccn(-c3ccccn3)c2n1
Show InChI InChI=1S/C17H12ClN5/c18-13-5-1-2-6-14(13)21-17-20-11-12-8-10-23(16(12)22-17)15-7-3-4-9-19-15/h1-11H,(H,20,21,22)
NCI pathway
Reactome pathway
n/an/a 700n/an/an/an/an/an/a
Genomics Institute of the Novartis Research Foundation (GNF)
Curated by ChEMBL
Assay Description
Inhibitory activity against FAK
Bioorg Med Chem Lett 16: 2173-6 (2006)
Article DOI: 10.1016/j.bmcl.2006.01.053
BindingDB Entry DOI: 10.7270/Q2319VGX