BDBM50182010 7-(pyridin-2-yl)-N-(2,4,6-trimethoxyphenyl)-7H-pyrrolo[2,3-d]pyrimidin-2-amine::7-(pyridin-2-yl)-N-(3,4,5-trimethoxyphenyl)-7H-pyrrolo[2,3-d]pyrimidin-2-amine::7-PYRIDIN-2-YL-N-(3,4,5-TRIMETHOXYPHENYL)-7H-PYRROLO[2,3-D]PYRIMIDIN-2-AMINE::CHEMBL205098
SMILES: COc1cc(Nc2ncc3ccn(-c4ccccn4)c3n2)cc(OC)c1OC
InChI Key: InChIKey=YENZSPIOXMNEFF-UHFFFAOYSA-N
Data: 3 IC50
PDB links: 1 PDB ID matches this monomer.
Activity Spreadsheet -- Enzyme Inhibition Constant Data from BindingDB
Found 3 hits for monomerid = 50182010
Trg + Lig
Ki
nM
ΔG°
kcal/mole
IC50
nM
Kd
nM
EC50/IC50
nM
koff
s-1
kon
M-1s-1
pHTemp
°C
Focal adhesion kinase 1
(Homo sapiens (Human))
BDBM50182010
(7-(pyridin-2-yl)-N-(2,4,6-trimethoxyphenyl)-7H-pyr...)
Show SMILES COc1cc(Nc2ncc3ccn(-c4ccccn4)c3n2)cc(OC)c1OC
Show InChI InChI=1S/C20H19N5O3/c1-26-15-10-14(11-16(27-2)18(15)28-3)23-20-22-12-13-7-9-25(19(13)24-20)17-6-4-5-8-21-17/h4-12H,1-3H3,(H,22,23,24)
NCI pathway
Reactome pathway
n/an/a 200n/an/an/an/an/an/a
Genomics Institute of the Novartis Research Foundation (GNF)
Curated by ChEMBL
Assay Description
Inhibitory activity against FAK
Bioorg Med Chem Lett 16: 2173-6 (2006)
Article DOI: 10.1016/j.bmcl.2006.01.053
BindingDB Entry DOI: 10.7270/Q2319VGX
3D
3D Structure (crystal)
Tyrosine-protein kinase JAK2
(Homo sapiens (Human))
BDBM50182010
(7-(pyridin-2-yl)-N-(2,4,6-trimethoxyphenyl)-7H-pyr...)
Show SMILES COc1cc(Nc2ncc3ccn(-c4ccccn4)c3n2)cc(OC)c1OC
Show InChI InChI=1S/C20H19N5O3/c1-26-15-10-14(11-16(27-2)18(15)28-3)23-20-22-12-13-7-9-25(19(13)24-20)17-6-4-5-8-21-17/h4-12H,1-3H3,(H,22,23,24)
Reactome pathway
n/an/a 5.90n/an/an/an/an/an/a
Novartis Institutes for BioMedical Research
Curated by ChEMBL
Assay Description
Inhibition of recombinant GST tagged JAK2 after 60 mins by Caliper mobility shift assay
Bioorg Med Chem Lett 20: 1858-60 (2010)
Article DOI: 10.1016/j.bmcl.2010.01.151
BindingDB Entry DOI: 10.7270/Q2PR7W4M
Focal adhesion kinase 1
(Homo sapiens (Human))
BDBM50182010
(7-(pyridin-2-yl)-N-(2,4,6-trimethoxyphenyl)-7H-pyr...)
Show SMILES COc1cc(Nc2ncc3ccn(-c4ccccn4)c3n2)cc(OC)c1OC
Show InChI InChI=1S/C20H19N5O3/c1-26-15-10-14(11-16(27-2)18(15)28-3)23-20-22-12-13-7-9-25(19(13)24-20)17-6-4-5-8-21-17/h4-12H,1-3H3,(H,22,23,24)
NCI pathway
Reactome pathway
n/an/a 212n/an/an/an/an/an/a
Genomics Institute of the Novartis Research Foundation (GNF)
Curated by ChEMBL
Assay Description
Inhibition of FAK
Bioorg Med Chem Lett 16: 2689-92 (2006)
Article DOI: 10.1016/j.bmcl.2006.02.032
BindingDB Entry DOI: 10.7270/Q2NK3DN0
3D
3D Structure (crystal)