null
SMILES: C1CN(CCO1)c1ncc2ccn(-c3ccccn3)c2n1
InChI Key: InChIKey=NQXZPIYMIFBJQX-UHFFFAOYSA-N
Activity Spreadsheet -- Enzyme Inhibition Constant Data from BindingDB
Found 1 hit for monomerid = 50182016
Trg + Lig
Ki
nM
ΔG°
kcal/mole
IC50
nM
Kd
nM
EC50/IC50
nM
koff
s-1
kon
M-1s-1
pHTemp
°C
Focal adhesion kinase 1
(Homo sapiens (Human))
BDBM50182016
(2-morpholino-7-(pyridin-2-yl)-7H-pyrrolo[2,3-d]pyr...)
Show SMILES C1CN(CCO1)c1ncc2ccn(-c3ccccn3)c2n1
Show InChI InChI=1S/C15H15N5O/c1-2-5-16-13(3-1)20-6-4-12-11-17-15(18-14(12)20)19-7-9-21-10-8-19/h1-6,11H,7-10H2
NCI pathway
Reactome pathway
n/an/a>1.00E+4n/an/an/an/an/an/a
Genomics Institute of the Novartis Research Foundation (GNF)
Curated by ChEMBL
Assay Description
Inhibitory activity against FAK
Bioorg Med Chem Lett 16: 2173-6 (2006)
Article DOI: 10.1016/j.bmcl.2006.01.053
BindingDB Entry DOI: 10.7270/Q2319VGX