null
SMILES: COc1ccc(Br)cc1CCc1c(F)cccc1C(=O)NC(N)=NCCCCN1CCc2ccccc2C1
InChI Key: InChIKey=PGMHROCZQVZYBR-UHFFFAOYSA-N
Activity Spreadsheet -- Enzyme Inhibition Constant Data from BindingDB
Found 2 hits for monomerid = 50182062
Trg + Lig
Ki
nM
ΔG°
kcal/mole
IC50
nM
Kd
nM
EC50/IC50
nM
koff
s-1
kon
M-1s-1
pHTemp
°C
Melanocortin receptor 4
(Homo sapiens (Human))
BDBM50182062
(CHEMBL205214 | N-{2-[2-(5-bromo-2-methoxy-phenyl)-...)
Show SMILES COc1ccc(Br)cc1CCc1c(F)cccc1C(=O)NC(N)=NCCCCN1CCc2ccccc2C1 |w:23.25|
Show InChI InChI=1S/C30H34BrFN4O2/c1-38-28-14-12-24(31)19-22(28)11-13-25-26(9-6-10-27(25)32)29(37)35-30(33)34-16-4-5-17-36-18-15-21-7-2-3-8-23(21)20-36/h2-3,6-10,12,14,19H,4-5,11,13,15-18,20H2,1H3,(H3,33,34,35,37)
26n/an/an/an/an/an/an/an/a
Millennium Pharmaceuticals, Inc.
Curated by ChEMBL
Assay Description
Binding affinity to MC4R by membrane filtration assay
Bioorg Med Chem Lett 16: 2302-5 (2006)
Article DOI: 10.1016/j.bmcl.2006.01.016
BindingDB Entry DOI: 10.7270/Q2PV6JZW
Melanocortin receptor 4
(Homo sapiens (Human))
BDBM50182062
(CHEMBL205214 | N-{2-[2-(5-bromo-2-methoxy-phenyl)-...)
Show SMILES COc1ccc(Br)cc1CCc1c(F)cccc1C(=O)NC(N)=NCCCCN1CCc2ccccc2C1 |w:23.25|
Show InChI InChI=1S/C30H34BrFN4O2/c1-38-28-14-12-24(31)19-22(28)11-13-25-26(9-6-10-27(25)32)29(37)35-30(33)34-16-4-5-17-36-18-15-21-7-2-3-8-23(21)20-36/h2-3,6-10,12,14,19H,4-5,11,13,15-18,20H2,1H3,(H3,33,34,35,37)
n/an/a 650n/an/an/an/an/an/a
Millennium Pharmaceuticals, Inc.
Curated by ChEMBL
Assay Description
Antagonist activity against MC4R by cAMP functional assay
Bioorg Med Chem Lett 16: 2302-5 (2006)
Article DOI: 10.1016/j.bmcl.2006.01.016
BindingDB Entry DOI: 10.7270/Q2PV6JZW