null
SMILES: CCN(CC)CCCC(C)N=C(NC(C)C)NC(=O)c1cccc(F)c1CCc1cc(Br)ccc1OC
InChI Key: InChIKey=GOXFSBYYVFRCOC-UHFFFAOYSA-N
Activity Spreadsheet -- Enzyme Inhibition Constant Data from BindingDB
Found 2 hits for monomerid = 50182071
Trg + Lig
Ki
nM
ΔG°
kcal/mole
IC50
nM
Kd
nM
EC50/IC50
nM
koff
s-1
kon
M-1s-1
pHTemp
°C
Melanocortin receptor 4
(Homo sapiens (Human))
BDBM50182071
(CHEMBL205898 | N-{2-[2-(5-bromo-2-methoxy-phenyl)-...)
Show SMILES CCN(CC)CCCC(C)N=C(NC(C)C)NC(=O)c1cccc(F)c1CCc1cc(Br)ccc1OC |w:10.9|
Show InChI InChI=1S/C29H42BrFN4O2/c1-7-35(8-2)18-10-11-21(5)33-29(32-20(3)4)34-28(36)25-12-9-13-26(31)24(25)16-14-22-19-23(30)15-17-27(22)37-6/h9,12-13,15,17,19-21H,7-8,10-11,14,16,18H2,1-6H3,(H2,32,33,34,36)
2.50E+3n/an/an/an/an/an/an/an/a
Millennium Pharmaceuticals, Inc.
Curated by ChEMBL
Assay Description
Binding affinity to MC4R by membrane filtration assay
Bioorg Med Chem Lett 16: 2302-5 (2006)
Article DOI: 10.1016/j.bmcl.2006.01.016
BindingDB Entry DOI: 10.7270/Q2PV6JZW
Melanocortin receptor 4
(Homo sapiens (Human))
BDBM50182071
(CHEMBL205898 | N-{2-[2-(5-bromo-2-methoxy-phenyl)-...)
Show SMILES CCN(CC)CCCC(C)N=C(NC(C)C)NC(=O)c1cccc(F)c1CCc1cc(Br)ccc1OC |w:10.9|
Show InChI InChI=1S/C29H42BrFN4O2/c1-7-35(8-2)18-10-11-21(5)33-29(32-20(3)4)34-28(36)25-12-9-13-26(31)24(25)16-14-22-19-23(30)15-17-27(22)37-6/h9,12-13,15,17,19-21H,7-8,10-11,14,16,18H2,1-6H3,(H2,32,33,34,36)
n/an/a 1.70E+4n/an/an/an/an/an/a
Millennium Pharmaceuticals, Inc.
Curated by ChEMBL
Assay Description
Antagonist activity against MC4R by cAMP functional assay
Bioorg Med Chem Lett 16: 2302-5 (2006)
Article DOI: 10.1016/j.bmcl.2006.01.016
BindingDB Entry DOI: 10.7270/Q2PV6JZW