null
SMILES: CCN1CCC(CN=C(N)NC(=O)c2cccc(F)c2CCc2cc(Br)ccc2OC)CC1
InChI Key: InChIKey=AMXJMRXFZPRCQM-UHFFFAOYSA-N
Activity Spreadsheet -- Enzyme Inhibition Constant Data from BindingDB
Found 2 hits for monomerid = 50182072
Trg + Lig
Ki
nM
ΔG°
kcal/mole
IC50
nM
Kd
nM
EC50/IC50
nM
koff
s-1
kon
M-1s-1
pHTemp
°C
Melanocortin receptor 4
(Homo sapiens (Human))
BDBM50182072
(CHEMBL205594 | N-{2-[2-(5-bromo-2-methoxy-phenyl)-...)
Show SMILES CCN1CCC(CN=C(N)NC(=O)c2cccc(F)c2CCc2cc(Br)ccc2OC)CC1 |w:7.6|
Show InChI InChI=1S/C25H32BrFN4O2/c1-3-31-13-11-17(12-14-31)16-29-25(28)30-24(32)21-5-4-6-22(27)20(21)9-7-18-15-19(26)8-10-23(18)33-2/h4-6,8,10,15,17H,3,7,9,11-14,16H2,1-2H3,(H3,28,29,30,32)
2.80n/an/an/an/an/an/an/an/a
Millennium Pharmaceuticals, Inc.
Curated by ChEMBL
Assay Description
Binding affinity to MC4R by membrane filtration assay
Bioorg Med Chem Lett 16: 2302-5 (2006)
Article DOI: 10.1016/j.bmcl.2006.01.016
BindingDB Entry DOI: 10.7270/Q2PV6JZW
Melanocortin receptor 4
(Homo sapiens (Human))
BDBM50182072
(CHEMBL205594 | N-{2-[2-(5-bromo-2-methoxy-phenyl)-...)
Show SMILES CCN1CCC(CN=C(N)NC(=O)c2cccc(F)c2CCc2cc(Br)ccc2OC)CC1 |w:7.6|
Show InChI InChI=1S/C25H32BrFN4O2/c1-3-31-13-11-17(12-14-31)16-29-25(28)30-24(32)21-5-4-6-22(27)20(21)9-7-18-15-19(26)8-10-23(18)33-2/h4-6,8,10,15,17H,3,7,9,11-14,16H2,1-2H3,(H3,28,29,30,32)
n/an/a 97n/an/an/an/an/an/a
Millennium Pharmaceuticals, Inc.
Curated by ChEMBL
Assay Description
Antagonist activity against MC4R by cAMP functional assay
Bioorg Med Chem Lett 16: 2302-5 (2006)
Article DOI: 10.1016/j.bmcl.2006.01.016
BindingDB Entry DOI: 10.7270/Q2PV6JZW