BDBM50182087 4-(1-(3-(5-acetyl-3-(4-(trifluoromethyl)phenyl)-4,5,6,7-tetrahydropyrazolo[4,3-c]pyridin-1-yl)-2-hydroxypropyl)piperidin-4-yl)-2H-benzo[b][1,4]oxazin-3(4H)-one::CHEMBL205919
SMILES: CC(=O)N1CCc2c(C1)c(nn2CC(O)CN1CCC(CC1)N1C(=O)COc2ccccc12)-c1ccc(cc1)C(F)(F)F
InChI Key: InChIKey=SGSPOYZDDMQIAD-UHFFFAOYSA-N
Data: 2 IC50
Activity Spreadsheet -- Enzyme Inhibition Constant Data from BindingDB
Found 2 hits for monomerid = 50182087
Trg + Lig
Ki
nM
ΔG°
kcal/mole
IC50
nM
Kd
nM
EC50/IC50
nM
koff
s-1
kon
M-1s-1
pHTemp
°C
Cathepsin S
(Homo sapiens (Human))
BDBM50182087
(4-(1-(3-(5-acetyl-3-(4-(trifluoromethyl)phenyl)-4,...)
Show SMILES CC(=O)N1CCc2c(C1)c(nn2CC(O)CN1CCC(CC1)N1C(=O)COc2ccccc12)-c1ccc(cc1)C(F)(F)F
Show InChI InChI=1S/C31H34F3N5O4/c1-20(40)37-15-12-26-25(18-37)30(21-6-8-22(9-7-21)31(32,33)34)35-38(26)17-24(41)16-36-13-10-23(11-14-36)39-27-4-2-3-5-28(27)43-19-29(39)42/h2-9,23-24,41H,10-19H2,1H3
Reactome pathway
n/an/a 120n/an/an/an/an/an/a
Johnson and Johnson Pharmaceutical Research and Development
Curated by ChEMBL
Assay Description
Inhibition of cathepsin S
Bioorg Med Chem Lett 16: 2209-12 (2006)
Article DOI: 10.1016/j.bmcl.2006.01.038
BindingDB Entry DOI: 10.7270/Q2K35T7W
HLA-DR antigens-associated invariant chain
(Homo sapiens (Human))
BDBM50182087
(4-(1-(3-(5-acetyl-3-(4-(trifluoromethyl)phenyl)-4,...)
Show SMILES CC(=O)N1CCc2c(C1)c(nn2CC(O)CN1CCC(CC1)N1C(=O)COc2ccccc12)-c1ccc(cc1)C(F)(F)F
Show InChI InChI=1S/C31H34F3N5O4/c1-20(40)37-15-12-26-25(18-37)30(21-6-8-22(9-7-21)31(32,33)34)35-38(26)17-24(41)16-36-13-10-23(11-14-36)39-27-4-2-3-5-28(27)43-19-29(39)42/h2-9,23-24,41H,10-19H2,1H3
Reactome pathway
n/an/a 1.10E+3n/an/an/an/an/an/a
Johnson and Johnson Pharmaceutical Research and Development
Curated by ChEMBL
Assay Description
Inhibition of MHC2 invariant chain
Bioorg Med Chem Lett 16: 2209-12 (2006)
Article DOI: 10.1016/j.bmcl.2006.01.038
BindingDB Entry DOI: 10.7270/Q2K35T7W