BDBM50182098 4-(1-(2-hydroxy-3-(5-(methylsulfonyl)-3-(4-(trifluoromethyl)phenyl)-4,5,6,7-tetrahydropyrazolo[4,3-c]pyridin-1-yl)propyl)piperidin-4-yl)-2H-pyrido[3,2-b][1,4]oxazin-3(4H)-one::CHEMBL239179
SMILES: CS(=O)(=O)N1CCc2c(C1)c(nn2CC(O)CN1CCC(CC1)N1C(=O)COc2cccnc12)-c1ccc(cc1)C(F)(F)F
InChI Key: InChIKey=ANFWDRBSMJXUMQ-UHFFFAOYSA-N
Data: 2 IC50
Activity Spreadsheet -- Enzyme Inhibition Constant Data from BindingDB
Found 2 hits for monomerid = 50182098
Trg + Lig
Ki
nM
ΔG°
kcal/mole
IC50
nM
Kd
nM
EC50/IC50
nM
koff
s-1
kon
M-1s-1
pHTemp
°C
HLA-DR antigens-associated invariant chain
(Homo sapiens (Human))
BDBM50182098
(4-(1-(2-hydroxy-3-(5-(methylsulfonyl)-3-(4-(triflu...)
Show SMILES CS(=O)(=O)N1CCc2c(C1)c(nn2CC(O)CN1CCC(CC1)N1C(=O)COc2cccnc12)-c1ccc(cc1)C(F)(F)F
Show InChI InChI=1S/C29H33F3N6O5S/c1-44(41,42)36-14-10-24-23(17-36)27(19-4-6-20(7-5-19)29(30,31)32)34-37(24)16-22(39)15-35-12-8-21(9-13-35)38-26(40)18-43-25-3-2-11-33-28(25)38/h2-7,11,21-22,39H,8-10,12-18H2,1H3
Reactome pathway
n/an/a 1.30E+3n/an/an/an/an/an/a
Johnson and Johnson Pharmaceutical Research and Development
Curated by ChEMBL
Assay Description
Inhibition of MHC2 invariant chain
Bioorg Med Chem Lett 16: 2209-12 (2006)
Article DOI: 10.1016/j.bmcl.2006.01.038
BindingDB Entry DOI: 10.7270/Q2K35T7W
Cathepsin S
(Homo sapiens (Human))
BDBM50182098
(4-(1-(2-hydroxy-3-(5-(methylsulfonyl)-3-(4-(triflu...)
Show SMILES CS(=O)(=O)N1CCc2c(C1)c(nn2CC(O)CN1CCC(CC1)N1C(=O)COc2cccnc12)-c1ccc(cc1)C(F)(F)F
Show InChI InChI=1S/C29H33F3N6O5S/c1-44(41,42)36-14-10-24-23(17-36)27(19-4-6-20(7-5-19)29(30,31)32)34-37(24)16-22(39)15-35-12-8-21(9-13-35)38-26(40)18-43-25-3-2-11-33-28(25)38/h2-7,11,21-22,39H,8-10,12-18H2,1H3
Reactome pathway
n/an/a 80n/an/an/an/an/an/a
Johnson and Johnson Pharmaceutical Research and Development
Curated by ChEMBL
Assay Description
Inhibition of cathepsin S
Bioorg Med Chem Lett 16: 2209-12 (2006)
Article DOI: 10.1016/j.bmcl.2006.01.038
BindingDB Entry DOI: 10.7270/Q2K35T7W