BDBM50182113 6-chloro-1-(1-(2-hydroxy-3-(5-(methylsulfonyl)-3-(4-(trifluoromethyl)phenyl)-4,5,6,7-tetrahydropyrazolo[4,3-c]pyridin-1-yl)propyl)piperidin-4-yl)-3,4-dihydroquinolin-2(1H)-one::CHEMBL377684
SMILES: CS(=O)(=O)N1CCc2c(C1)c(nn2CC(O)CN1CCC(CC1)N1C(=O)CCc2cc(Cl)ccc12)-c1ccc(cc1)C(F)(F)F
InChI Key: InChIKey=FGUVGHPZGGMLJY-UHFFFAOYSA-N
Data: 2 IC50
Activity Spreadsheet -- Enzyme Inhibition Constant Data from BindingDB
Found 2 hits for monomerid = 50182113
Trg + Lig
Ki
nM
ΔG°
kcal/mole
IC50
nM
Kd
nM
EC50/IC50
nM
koff
s-1
kon
M-1s-1
pHTemp
°C
HLA-DR antigens-associated invariant chain
(Homo sapiens (Human))
BDBM50182113
(6-chloro-1-(1-(2-hydroxy-3-(5-(methylsulfonyl)-3-(...)
Show SMILES CS(=O)(=O)N1CCc2c(C1)c(nn2CC(O)CN1CCC(CC1)N1C(=O)CCc2cc(Cl)ccc12)-c1ccc(cc1)C(F)(F)F
Show InChI InChI=1S/C31H35ClF3N5O4S/c1-45(43,44)38-15-12-28-26(19-38)30(20-2-5-22(6-3-20)31(33,34)35)36-39(28)18-25(41)17-37-13-10-24(11-14-37)40-27-8-7-23(32)16-21(27)4-9-29(40)42/h2-3,5-8,16,24-25,41H,4,9-15,17-19H2,1H3
Reactome pathway
n/an/a 980n/an/an/an/an/an/a
Johnson and Johnson Pharmaceutical Research and Development
Curated by ChEMBL
Assay Description
Inhibition of MHC2 invariant chain
Bioorg Med Chem Lett 16: 2209-12 (2006)
Article DOI: 10.1016/j.bmcl.2006.01.038
BindingDB Entry DOI: 10.7270/Q2K35T7W
Cathepsin S
(Homo sapiens (Human))
BDBM50182113
(6-chloro-1-(1-(2-hydroxy-3-(5-(methylsulfonyl)-3-(...)
Show SMILES CS(=O)(=O)N1CCc2c(C1)c(nn2CC(O)CN1CCC(CC1)N1C(=O)CCc2cc(Cl)ccc12)-c1ccc(cc1)C(F)(F)F
Show InChI InChI=1S/C31H35ClF3N5O4S/c1-45(43,44)38-15-12-28-26(19-38)30(20-2-5-22(6-3-20)31(33,34)35)36-39(28)18-25(41)17-37-13-10-24(11-14-37)40-27-8-7-23(32)16-21(27)4-9-29(40)42/h2-3,5-8,16,24-25,41H,4,9-15,17-19H2,1H3
Reactome pathway
n/an/a 13n/an/an/an/an/an/a
Johnson and Johnson Pharmaceutical Research and Development
Curated by ChEMBL
Assay Description
Inhibition of cathepsin S
Bioorg Med Chem Lett 16: 2209-12 (2006)
Article DOI: 10.1016/j.bmcl.2006.01.038
BindingDB Entry DOI: 10.7270/Q2K35T7W