BDBM50182135 3-(4-methoxybenzofuran-5-yl)-5-phenyl-4,5-dihydroisoxazole::CHEMBL208485
SMILES: COc1c(ccc2occc12)C1=NOC(C1)c1ccccc1
InChI Key: InChIKey=USHIACGOJWXTMQ-UHFFFAOYSA-N
Data: 1 KI  2 IC50
Activity Spreadsheet -- Enzyme Inhibition Constant Data from BindingDB
Found 3 hits for monomerid = 50182135
Trg + Lig
Ki
nM
ΔG°
kcal/mole
IC50
nM
Kd
nM
EC50/IC50
nM
koff
s-1
kon
M-1s-1
pHTemp
°C
Protein-tyrosine phosphatase 1B
(Homo sapiens (Human))
BDBM50182135
(3-(4-methoxybenzofuran-5-yl)-5-phenyl-4,5-dihydroi...)
Show SMILES COc1c(ccc2occc12)C1=NOC(C1)c1ccccc1 |t:13|
Show InChI InChI=1S/C18H15NO3/c1-20-18-13(7-8-16-14(18)9-10-21-16)15-11-17(22-19-15)12-5-3-2-4-6-12/h2-10,17H,11H2,1H3
NCI pathway
Reactome pathway
4.50E+4n/an/an/an/an/an/an/an/a
Central Drug Research Institute
Curated by ChEMBL
Assay Description
Inhibition of PTP1B
Bioorg Med Chem Lett 16: 2139-43 (2006)
Article DOI: 10.1016/j.bmcl.2006.01.062
BindingDB Entry DOI: 10.7270/Q29K49ST
Protein-tyrosine phosphatase 1B
(Homo sapiens (Human))
BDBM50182135
(3-(4-methoxybenzofuran-5-yl)-5-phenyl-4,5-dihydroi...)
Show SMILES COc1c(ccc2occc12)C1=NOC(C1)c1ccccc1 |t:13|
Show InChI InChI=1S/C18H15NO3/c1-20-18-13(7-8-16-14(18)9-10-21-16)15-11-17(22-19-15)12-5-3-2-4-6-12/h2-10,17H,11H2,1H3
NCI pathway
Reactome pathway
n/an/a 7.60E+4n/an/an/an/an/an/a
Central Drug Research Institute,
Assay Description
The effect of the test compounds on PTP1B was studied by preincubating the test compound with enzyme in the reaction system for 10 min and determinin...
Medicinal Chemistry Research 17: 123-136 (2008)
BindingDB Entry DOI: 10.7270/Q2JQ0ZMG
Protein-tyrosine phosphatase 1B
(Homo sapiens (Human))
BDBM50182135
(3-(4-methoxybenzofuran-5-yl)-5-phenyl-4,5-dihydroi...)
Show SMILES COc1c(ccc2occc12)C1=NOC(C1)c1ccccc1 |t:13|
Show InChI InChI=1S/C18H15NO3/c1-20-18-13(7-8-16-14(18)9-10-21-16)15-11-17(22-19-15)12-5-3-2-4-6-12/h2-10,17H,11H2,1H3
NCI pathway
Reactome pathway
n/an/a 2.27E+5n/an/an/an/an/an/a
Central Drug Research Institute
Curated by ChEMBL
Assay Description
Inhibition of PTP1B
Bioorg Med Chem Lett 16: 2139-43 (2006)
Article DOI: 10.1016/j.bmcl.2006.01.062
BindingDB Entry DOI: 10.7270/Q29K49ST