BDBM50182267 CHEMBL3818853
SMILES: Oc1c(NC(=O)Nc2cccc(F)c2Cl)ccc(Cl)c1S(=O)(=O)C1CCCC1
InChI Key: InChIKey=YIZKXDBXMQGWKD-UHFFFAOYSA-N
Data: 2 IC50
Activity Spreadsheet -- Enzyme Inhibition Constant Data from BindingDB
Found 2 hits for monomerid = 50182267
Trg + Lig
Ki
nM
ΔG°
kcal/mole
IC50
nM
Kd
nM
EC50/IC50
nM
koff
s-1
kon
M-1s-1
pHTemp
°C
C-X-C chemokine receptor type 2
(Homo sapiens (Human))
BDBM50182267
(CHEMBL3818853)
Show SMILES Oc1c(NC(=O)Nc2cccc(F)c2Cl)ccc(Cl)c1S(=O)(=O)C1CCCC1
Show InChI InChI=1S/C18H17Cl2FN2O4S/c19-11-8-9-14(16(24)17(11)28(26,27)10-4-1-2-5-10)23-18(25)22-13-7-3-6-12(21)15(13)20/h3,6-10,24H,1-2,4-5H2,(H2,22,23,25)
Reactome pathway
n/an/a 25n/an/an/an/an/an/a
Peking Union Medical College and Chinese Academy of Medical Sciences
Curated by ChEMBL
Assay Description
Antagonist activity at human recombinant CXCR2 assessed as inhibition of CXCL1-induced neutrophil chemotaxis after 45 mins by calcein-AM dye based pl...
ACS Med Chem Lett 7: 397-402 (2016)
BindingDB Entry DOI: 10.7270/Q2KW5HZH
C-X-C chemokine receptor type 2
(Homo sapiens (Human))
BDBM50182267
(CHEMBL3818853)
Show SMILES Oc1c(NC(=O)Nc2cccc(F)c2Cl)ccc(Cl)c1S(=O)(=O)C1CCCC1
Show InChI InChI=1S/C18H17Cl2FN2O4S/c19-11-8-9-14(16(24)17(11)28(26,27)10-4-1-2-5-10)23-18(25)22-13-7-3-6-12(21)15(13)20/h3,6-10,24H,1-2,4-5H2,(H2,22,23,25)
Reactome pathway
n/an/a 0.316n/an/an/an/an/an/a
Peking Union Medical College and Chinese Academy of Medical Sciences
Curated by ChEMBL
Assay Description
Antagonist activity at human recombinant Gal4-VP16 fused-CXCR2 assessed as inhibition of CXCL1-mediated lactamase reporter gene expression after over...
ACS Med Chem Lett 7: 397-402 (2016)
BindingDB Entry DOI: 10.7270/Q2KW5HZH