BDBM50182324 (2S,3S,4R,5R)-5-(6-(5-chloro-2-(2-oxo-2-(piperazin-1-yl)ethoxy)benzylamino)-9H-purin-9-yl)-3-amino-4-hydroxy-N-methyl-tetrahydrofuran-2-carboxamide::CHEMBL209352
SMILES: CNC(=O)[C@H]1O[C@H]([C@H](O)[C@@H]1N)n1cnc2c(NCc3cc(Cl)ccc3OCC(=O)N3CCNCC3)ncnc12
InChI Key: InChIKey=VWPGXXNJBZSNKH-QLBZUPSYSA-N
Data: 1 KI  1 EC50
Activity Spreadsheet -- Enzyme Inhibition Constant Data from BindingDB
Found 2 hits for monomerid = 50182324
Trg + Lig
Ki
nM
ΔG°
kcal/mole
IC50
nM
Kd
nM
EC50/IC50
nM
koff
s-1
kon
M-1s-1
pHTemp
°C
Adenosine receptor A3
(Homo sapiens (Human))
BDBM50182324
((2S,3S,4R,5R)-5-(6-(5-chloro-2-(2-oxo-2-(piperazin...)
Show SMILES CNC(=O)[C@H]1O[C@H]([C@H](O)[C@@H]1N)n1cnc2c(NCc3cc(Cl)ccc3OCC(=O)N3CCNCC3)ncnc12
Show InChI InChI=1S/C24H30ClN9O5/c1-27-23(37)20-17(26)19(36)24(39-20)34-12-32-18-21(30-11-31-22(18)34)29-9-13-8-14(25)2-3-15(13)38-10-16(35)33-6-4-28-5-7-33/h2-3,8,11-12,17,19-20,24,28,36H,4-7,9-10,26H2,1H3,(H,27,37)(H,29,30,31)/t17-,19+,20-,24+/m0/s1
Reactome pathway
9.40n/an/an/an/an/an/an/an/a
Pfizer Global Research and Development
Curated by ChEMBL
Assay Description
Binding affinity to human adenosine A3 receptor
Bioorg Med Chem Lett 16: 2525-7 (2006)
Article DOI: 10.1016/j.bmcl.2006.01.088
BindingDB Entry DOI: 10.7270/Q2J38S4Z
Adenosine receptor A3
(Homo sapiens (Human))
BDBM50182324
((2S,3S,4R,5R)-5-(6-(5-chloro-2-(2-oxo-2-(piperazin...)
Show SMILES CNC(=O)[C@H]1O[C@H]([C@H](O)[C@@H]1N)n1cnc2c(NCc3cc(Cl)ccc3OCC(=O)N3CCNCC3)ncnc12
Show InChI InChI=1S/C24H30ClN9O5/c1-27-23(37)20-17(26)19(36)24(39-20)34-12-32-18-21(30-11-31-22(18)34)29-9-13-8-14(25)2-3-15(13)38-10-16(35)33-6-4-28-5-7-33/h2-3,8,11-12,17,19-20,24,28,36H,4-7,9-10,26H2,1H3,(H,27,37)(H,29,30,31)/t17-,19+,20-,24+/m0/s1
Reactome pathway
n/an/an/an/a 8.10n/an/an/an/a
Pfizer Global Research and Development
Curated by ChEMBL
Assay Description
Inhibition of isoproterenol-induced increase of cAMP in HEK293 cell expressing human adenosine A3 receptor
Bioorg Med Chem Lett 16: 2525-7 (2006)
Article DOI: 10.1016/j.bmcl.2006.01.088
BindingDB Entry DOI: 10.7270/Q2J38S4Z