BDBM50182420 CHEMBL3819600
SMILES: COC(CO)Cc1csc(Nc2cc(c(C)cc2OC)-c2ccccc2C)n1
InChI Key: InChIKey=WAUBHYVHOWZPMH-UHFFFAOYSA-N
Data: 2 IC50
Activity Spreadsheet -- Enzyme Inhibition Constant Data from BindingDB
Found 2 hits for monomerid = 50182420
Trg + Lig
Ki
nM
ΔG°
kcal/mole
IC50
nM
Kd
nM
EC50/IC50
nM
koff
s-1
kon
M-1s-1
pHTemp
°C
LDL-associated phospholipase A2
(Homo sapiens (Human))
BDBM50182420
(CHEMBL3819600)
Show SMILES COC(CO)Cc1csc(Nc2cc(c(C)cc2OC)-c2ccccc2C)n1
Show InChI InChI=1S/C22H26N2O3S/c1-14-7-5-6-8-18(14)19-11-20(21(27-4)9-15(19)2)24-22-23-16(13-28-22)10-17(12-25)26-3/h5-9,11,13,17,25H,10,12H2,1-4H3,(H,23,24)
NCI pathway
Reactome pathway
n/an/a 320n/an/an/an/an/an/a
Astex Pharmaceuticals
Curated by ChEMBL
Assay Description
Inhibition of Lp-PLA2 in human whole plasma using 2-thio-PAF as substrate preincubated for 15 mins followed by substrate addition measured after 3 mi...
J Med Chem 59: 5356-67 (2016)
BindingDB Entry DOI: 10.7270/Q2Z60R0G
LDL-associated phospholipase A2
(Homo sapiens (Human))
BDBM50182420
(CHEMBL3819600)
Show SMILES COC(CO)Cc1csc(Nc2cc(c(C)cc2OC)-c2ccccc2C)n1
Show InChI InChI=1S/C22H26N2O3S/c1-14-7-5-6-8-18(14)19-11-20(21(27-4)9-15(19)2)24-22-23-16(13-28-22)10-17(12-25)26-3/h5-9,11,13,17,25H,10,12H2,1-4H3,(H,23,24)
NCI pathway
Reactome pathway
n/an/a 3.60n/an/an/an/an/an/a
Astex Pharmaceuticals
Curated by ChEMBL
Assay Description
Inhibition of human recombinant Lp-PLA2 using 2-thio-PAF as substrate after 20 mins by CPM-based fluorescence assay
J Med Chem 59: 5356-67 (2016)
BindingDB Entry DOI: 10.7270/Q2Z60R0G