BDBM50182428 CHEMBL3819632
SMILES: Cc1ccc(cc1-c1ccccc1Cl)C(=O)N1CC=CC1
InChI Key: InChIKey=ZRFFQNUCWAFOSS-UHFFFAOYSA-N
Data: 1 IC50
Activity Spreadsheet -- Enzyme Inhibition Constant Data from BindingDB
Found 1 hit for monomerid = 50182428
Trg + Lig
Ki
nM
ΔG°
kcal/mole
IC50
nM
Kd
nM
EC50/IC50
nM
koff
s-1
kon
M-1s-1
pHTemp
°C
LDL-associated phospholipase A2
(Homo sapiens (Human))
BDBM50182428
(CHEMBL3819632)
Show SMILES Cc1ccc(cc1-c1ccccc1Cl)C(=O)N1CC=CC1 |c:20|
Show InChI InChI=1S/C18H16ClNO/c1-13-8-9-14(18(21)20-10-4-5-11-20)12-16(13)15-6-2-3-7-17(15)19/h2-9,12H,10-11H2,1H3
NCI pathway
Reactome pathway
n/an/a 180n/an/an/an/an/an/a
Astex Pharmaceuticals
Curated by ChEMBL
Assay Description
Inhibition of human recombinant Lp-PLA2 using 2-thio-PAF as substrate after 20 mins by CPM-based fluorescence assay
J Med Chem 59: 5356-67 (2016)
BindingDB Entry DOI: 10.7270/Q2Z60R0G