BDBM50182429 CHEMBL3818759
SMILES: Cc1ccccc1-c1cc(ccc1C)C(=O)N1CC=CC1
InChI Key: InChIKey=NIOIWNZLGVRPNS-UHFFFAOYSA-N
Data: 1 IC50
PDB links: 1 PDB ID matches this monomer.
Activity Spreadsheet -- Enzyme Inhibition Constant Data from BindingDB
Found 1 hit for monomerid = 50182429
Trg + Lig
Ki
nM
ΔG°
kcal/mole
IC50
nM
Kd
nM
EC50/IC50
nM
koff
s-1
kon
M-1s-1
pHTemp
°C
Platelet-activating factor acetylhydrolase
(Homo sapiens (Human))
BDBM50182429
(CHEMBL3818759)
Show SMILES Cc1ccccc1-c1cc(ccc1C)C(=O)N1CC=CC1 |c:20|
Show InChI InChI=1S/C19H19NO/c1-14-7-3-4-8-17(14)18-13-16(10-9-15(18)2)19(21)20-11-5-6-12-20/h3-10,13H,11-12H2,1-2H3
NCI pathway
Reactome pathway
n/an/a 230n/an/an/an/an/an/a
Astex Pharmaceuticals
Curated by ChEMBL
Assay Description
Inhibition of human recombinant Lp-PLA2 using 2-thio-PAF as substrate after 20 mins by CPM-based fluorescence assay
J Med Chem 59: 5356-67 (2016)
BindingDB Entry DOI: 10.7270/Q2Z60R0G
3D
3D Structure (crystal)