BDBM50182755 CHEMBL3818117
SMILES: Cl.Fc1cc(ccc1Cl)[C@@H]1OCCNC[C@H]1CN1CCCNC1=O
InChI Key: InChIKey=BALZOYHHBVRKSZ-NXCSSKFKSA-N
Data: 3 IC50
Activity Spreadsheet -- Enzyme Inhibition Constant Data from BindingDB
Found 3 hits for monomerid = 50182755
Trg + Lig
Ki
nM
ΔG°
kcal/mole
IC50
nM
Kd
nM
EC50/IC50
nM
koff
s-1
kon
M-1s-1
pHTemp
°C
Sodium-dependent noradrenaline transporter
(Homo sapiens (Human))
BDBM50182755
(CHEMBL3818117)
Show SMILES Cl.Fc1cc(ccc1Cl)[C@@H]1OCCNC[C@H]1CN1CCCNC1=O |r|
Show InChI InChI=1S/C16H21ClFN3O2.ClH/c17-13-3-2-11(8-14(13)18)15-12(9-19-5-7-23-15)10-21-6-1-4-20-16(21)22;/h2-3,8,12,15,19H,1,4-7,9-10H2,(H,20,22);1H/t12-,15-;/m0./s1
Reactome pathway
n/an/a 0.0800n/an/an/an/an/an/a
Takeda Pharmaceutical Company Ltd
Curated by ChEMBL
Assay Description
Inhibition of human NET expressed in CHO cells assessed as [3H]-Norepinephrine reuptake incubated for 45 mins measured after 30 mins by topcount meth...
Bioorg Med Chem 24: 3716-26 (2016)
BindingDB Entry DOI: 10.7270/Q2NP26B4
Sodium-dependent dopamine transporter
(Homo sapiens (Human))
BDBM50182755
(CHEMBL3818117)
Show SMILES Cl.Fc1cc(ccc1Cl)[C@@H]1OCCNC[C@H]1CN1CCCNC1=O |r|
Show InChI InChI=1S/C16H21ClFN3O2.ClH/c17-13-3-2-11(8-14(13)18)15-12(9-19-5-7-23-15)10-21-6-1-4-20-16(21)22;/h2-3,8,12,15,19H,1,4-7,9-10H2,(H,20,22);1H/t12-,15-;/m0./s1
NCI pathway
Reactome pathway
n/an/a 66n/an/an/an/an/an/a
Takeda Pharmaceutical Company Ltd
Curated by ChEMBL
Assay Description
Inhibition of human DAT expressed in CHO cells assessed as [3H]-dopamine reuptake incubated for 60 mins measured after 30 mins by topcount method
Bioorg Med Chem 24: 3716-26 (2016)
BindingDB Entry DOI: 10.7270/Q2NP26B4
Sodium-dependent serotonin transporter
(Homo sapiens (Human))
BDBM50182755
(CHEMBL3818117)
Show SMILES Cl.Fc1cc(ccc1Cl)[C@@H]1OCCNC[C@H]1CN1CCCNC1=O |r|
Show InChI InChI=1S/C16H21ClFN3O2.ClH/c17-13-3-2-11(8-14(13)18)15-12(9-19-5-7-23-15)10-21-6-1-4-20-16(21)22;/h2-3,8,12,15,19H,1,4-7,9-10H2,(H,20,22);1H/t12-,15-;/m0./s1
n/an/a 12n/an/an/an/an/an/a
Takeda Pharmaceutical Company Ltd
Curated by ChEMBL
Assay Description
Inhibition of human SERT expressed in CHO cells assessed as [3H]-5-hydroxytryptamine reuptake incubated for 20 mins measured after 30 mins by topcoun...
Bioorg Med Chem 24: 3716-26 (2016)
BindingDB Entry DOI: 10.7270/Q2NP26B4