BDBM50182757 CHEMBL3819201
SMILES: Cl.Fc1cc(ccc1Cl)[C@@H]1OCCNC[C@H]1Cn1ccccc1=O
InChI Key: InChIKey=OMLNMFMFOPKHMJ-KYLFUZKPSA-N
Data: 3 IC50
Activity Spreadsheet -- Enzyme Inhibition Constant Data from BindingDB
Found 3 hits for monomerid = 50182757
Trg + Lig
Ki
nM
ΔG°
kcal/mole
IC50
nM
Kd
nM
EC50/IC50
nM
koff
s-1
kon
M-1s-1
pHTemp
°C
Sodium-dependent noradrenaline transporter
(Homo sapiens (Human))
BDBM50182757
(CHEMBL3819201)
Show SMILES Cl.Fc1cc(ccc1Cl)[C@@H]1OCCNC[C@H]1Cn1ccccc1=O |r|
Show InChI InChI=1S/C17H18ClFN2O2.ClH/c18-14-5-4-12(9-15(14)19)17-13(10-20-6-8-23-17)11-21-7-2-1-3-16(21)22;/h1-5,7,9,13,17,20H,6,8,10-11H2;1H/t13-,17-;/m0./s1
Reactome pathway
n/an/a 0.0790n/an/an/an/an/an/a
Takeda Pharmaceutical Company Ltd
Curated by ChEMBL
Assay Description
Inhibition of human NET expressed in CHO cells assessed as [3H]-Norepinephrine reuptake incubated for 45 mins measured after 30 mins by topcount meth...
Bioorg Med Chem 24: 3716-26 (2016)
BindingDB Entry DOI: 10.7270/Q2NP26B4
Sodium-dependent dopamine transporter
(Homo sapiens (Human))
BDBM50182757
(CHEMBL3819201)
Show SMILES Cl.Fc1cc(ccc1Cl)[C@@H]1OCCNC[C@H]1Cn1ccccc1=O |r|
Show InChI InChI=1S/C17H18ClFN2O2.ClH/c18-14-5-4-12(9-15(14)19)17-13(10-20-6-8-23-17)11-21-7-2-1-3-16(21)22;/h1-5,7,9,13,17,20H,6,8,10-11H2;1H/t13-,17-;/m0./s1
NCI pathway
Reactome pathway
n/an/a>1.00E+3n/an/an/an/an/an/a
Takeda Pharmaceutical Company Ltd
Curated by ChEMBL
Assay Description
Inhibition of human DAT expressed in CHO cells assessed as [3H]-dopamine reuptake incubated for 60 mins measured after 30 mins by topcount method
Bioorg Med Chem 24: 3716-26 (2016)
BindingDB Entry DOI: 10.7270/Q2NP26B4
Sodium-dependent serotonin transporter
(Homo sapiens (Human))
BDBM50182757
(CHEMBL3819201)
Show SMILES Cl.Fc1cc(ccc1Cl)[C@@H]1OCCNC[C@H]1Cn1ccccc1=O |r|
Show InChI InChI=1S/C17H18ClFN2O2.ClH/c18-14-5-4-12(9-15(14)19)17-13(10-20-6-8-23-17)11-21-7-2-1-3-16(21)22;/h1-5,7,9,13,17,20H,6,8,10-11H2;1H/t13-,17-;/m0./s1
n/an/a 130n/an/an/an/an/an/a
Takeda Pharmaceutical Company Ltd
Curated by ChEMBL
Assay Description
Inhibition of human SERT expressed in CHO cells assessed as [3H]-5-hydroxytryptamine reuptake incubated for 20 mins measured after 30 mins by topcoun...
Bioorg Med Chem 24: 3716-26 (2016)
BindingDB Entry DOI: 10.7270/Q2NP26B4