null
SMILES: Clc1ccc(Sc2ccnc(n2)-c2ccccn2)cc1Cl
InChI Key: InChIKey=OHXDZMRKYJSXLE-UHFFFAOYSA-N
Activity Spreadsheet -- Enzyme Inhibition Constant Data from BindingDB
Found 1 hit for monomerid = 50182811
Trg + Lig
Ki
nM
ΔG°
kcal/mole
IC50
nM
Kd
nM
EC50/IC50
nM
koff
s-1
kon
M-1s-1
pHTemp
°C
Metabotropic glutamate receptor 5
(Homo sapiens (Human))
BDBM50182811
(4-(3,4-dichlorophenylthio)-2-(pyridin-2-yl)pyrimid...)
Show SMILES Clc1ccc(Sc2ccnc(n2)-c2ccccn2)cc1Cl
Show InChI InChI=1S/C15H9Cl2N3S/c16-11-5-4-10(9-12(11)17)21-14-6-8-19-15(20-14)13-3-1-2-7-18-13/h1-9H
n/an/a 90n/an/an/an/an/an/a
NPS-Pharmaceuticals
Curated by ChEMBL
Assay Description
Inhibition of glutamate-induced calcium influx in human mGluR5d by FLIPR
Bioorg Med Chem Lett 16: 2467-9 (2006)
Article DOI: 10.1016/j.bmcl.2006.01.100
BindingDB Entry DOI: 10.7270/Q22Z1544